program: Orca
programVersion: 5.0.4
elementType: C H
charge: -2
multiplicity: 2
keywords: Opt RIJCOSX PBEh-3c
formula: CH
InChI: InChI=1/CH/h1H
2 atoms
C  0.141989 0.0000 0.0000
H  -1.089028 0.0000 0.0000
totalener: -38.00403214 hartree
nucrepener: 2.83348254 hartree
electener: -40.83751468 hartree
oneelecener: -61.69403332 hartree
twoeener: 20.85651864 hartree
kineticenergy: 38.34105989 hartree
exchangeener: -3.277183994180 hartree
correlationener: -0.346708805824 hartree
xcener: -3.623892800003 hartree
s2: 0.752142
dispersion: -0.000138920 hartree
s2: 0.752193
dispersion: -0.000139278 hartree
s2: 0.752225
dispersion: -0.000139669 hartree
s2: 0.752239
dispersion: -0.000139894 hartree
s2: 0.752242
dispersion: -0.000139937 hartree
energy: -265.8231 0.5428 8.7341 10.9862 12.2520 19.8963 31.7152 32.2386 32.7776 37.4815 42.4207 66.9623 67.8661 67.8901 68.0661 75.7376 381.3562 electronvolt
energy: -265.5578 1.7517 9.3081 12.7124 17.2089 20.2420 32.5876 33.1288 34.0910 38.1654 42.7815 68.2964 68.5720 69.4352 69.5937 76.2893 381.7605 electronvolt
chargesum: -2.0000000
charge: -1.684444 -0.315556
charge: -1.827524 -0.172476
qa: -1.6844 -0.3156
va: 1.8433 0.8404
dispersion: -0.000139940 hartree
energy: -38.007475000225 hartree
dipole: -1.06549 0.86403 -0.20146 0.00000 -0.00000 -0.00000 0.00000 -0.00000 -0.00000
magnitude: 0.20146 au
magnitude: 0.51208 debye
