program: Gaussian 09
title: 000004768
version: EM64L-G09RevD.01
frameworkgroup: C1[X(C18H22ClNO)]
method: RPBEPBE
basis: SDD
operation: Freq
keyword: #p
keyword: freq=noraman
keyword: PBEPBE/SDD
title: #p freq=noraman PBEPBE/SDD
converged: YES YES NO NO
title: Mulliken charges:
elementType: Cl O N C C C C C C C C C C C C C C C C C C H H H H H H H H H H H H H H H H H H H H H H
charge: -0.100166 -0.282716 -0.112830 -0.113698 -0.546706 -0.337800 -0.292344 -0.704130 0.498953 -0.569846 -0.381644 -0.464167 0.389897 -0.234586 -0.218936 -0.244312 -0.350622 -0.393163 -0.220926 -0.197864 -0.257583 0.229254 0.216416 0.214534 0.235047 0.223732 0.210625 0.210496 0.220868 0.208360 0.232127 0.275491 0.287535 0.276183 0.230962 0.230542 0.224793 0.227963 0.248667 0.250252 0.223708 0.228769 0.228866
chargesum: 0.00000
title: Mulliken charges with hydrogens summed into heavy atoms:
elementType: Cl O N C C C C C C C C C C C C C C C C C C
charge: -0.100166 -0.282716 -0.112830 0.115556 -0.115756 0.120979 0.128777 -0.042775 0.498953 -0.006820 -0.105461 -0.233205 0.389897 -0.004044 0.005857 -0.016349 -0.101955 -0.142911 0.002782 0.030905 -0.028717
polarizability: 2.29666634e+02 1.32817451e+01 1.92500970e+02 -1.29212877e+01 -1.31767285e+01 2.05308743e+02
1716.lowfreq: -10.3430 -4.4752 0.0012 0.0014 0.0018 2.8973 11.1133 18.8030 25.9899
frequency: 10.9446 18.7540 25.8926 30.4099 34.6655 56.5822 77.3142 88.9756 105.3763 123.6000 156.3143 182.7085 198.0807 206.1607 227.1409 231.5852 243.7184 263.1798 317.6396 364.6385 405.6931 409.4670 412.8785 454.0091 462.8824 473.6782 502.0498 546.5197 585.8138 600.8231 610.3636 615.2524 648.8883 692.4280 709.0792 741.9790 757.4176 761.4733 780.5880 794.7964 804.4286 824.7472 863.2705 888.0577 891.8825 913.6688 918.9164 959.5366 962.5633 977.5945 983.3070 983.7995 985.3624 989.5277 993.1529 1004.7462 1022.7257 1024.0448 1035.0467 1050.8489 1073.2488 1084.2182 1087.4519 1105.2473 1149.2379 1167.2095 1170.3822 1171.6312 1178.5570 1185.5229 1197.5750 1209.8150 1215.6106 1243.3479 1255.5321 1271.1303 1285.8664 1308.7676 1313.8137 1329.7774 1352.6624 1362.0983 1365.5039 1381.4635 1387.8940 1389.6607 1398.6018 1441.5444 1443.0987 1450.9763 1457.1247 1468.1042 1469.7508 1471.5775 1477.5060 1482.4206 1483.6105 1591.2932 1594.4759 1611.1773 1612.9593 2890.7328 2948.3077 2949.8912 2978.5295 2995.1418 3003.4191 3019.1079 3046.7649 3068.4894 3073.5063 3084.1901 3108.9480 3122.1076 3128.6303 3133.3149 3137.4486 3143.8071 3155.0424 3159.1948 3160.8889 3163.1675 3172.6585
redmass: 5.3250 7.0909 6.3347 3.9171 4.6071 4.1899 4.1198 2.5297 3.9068 3.9590 3.8769 5.6786 2.1504 1.3708 4.3949 2.7743 2.7407 4.7598 4.2904 2.1508 3.0790 3.0166 3.0985 3.4663 3.5627 3.5357 2.8987 3.3686 4.6370 4.6087 6.3931 6.3374 5.5454 2.0845 2.2558 1.6034 1.6393 1.4179 2.2485 4.4906 3.4637 1.2528 1.2480 1.5051 1.5991 1.3989 1.5950 2.0303 1.4009 3.3461 1.5246 2.2751 1.4178 4.7757 2.5003 1.3678 2.0406 2.1523 1.9134 4.3589 2.1552 1.5514 1.7036 1.6520 1.8717 1.1384 1.3883 1.2073 1.2075 1.1145 1.6843 1.9659 3.0275 1.1606 1.6194 1.2918 1.2644 1.3591 1.3381 1.4169 1.4651 1.4893 1.4679 1.3482 3.7079 3.4421 1.4778 2.0797 2.3114 1.0929 1.1340 1.1791 1.1563 1.1155 1.2231 1.6048 1.6735 6.3964 6.0854 6.2442 5.9622 1.0698 1.0661 1.0559 1.0359 1.0879 1.0940 1.0971 1.0961 1.0566 1.0993 1.0998 1.0875 1.0859 1.0848 1.0909 1.0888 1.0958 1.0924 1.1124 1.1014 1.0953 1.1007
irintensity: 0.0424 0.1501 0.3497 0.0045 0.4757 0.1393 0.4612 3.7711 0.4538 1.7181 2.4854 1.7613 2.5213 0.6562 1.8654 6.0229 0.9490 3.3497 2.3679 3.9620 2.6824 0.6913 0.8838 3.7328 8.2170 11.6733 10.4969 15.7789 5.2770 9.1191 0.2001 1.5213 89.3432 30.8473 21.5963 68.2861 71.6004 37.8282 16.1977 4.8329 12.7343 0.7692 0.3146 4.3882 6.5690 6.7613 2.9810 28.7820 2.1950 38.0810 1.1828 8.2231 0.8925 0.4947 24.4721 0.9363 17.8044 9.4590 9.6731 4.3957 8.6739 12.5235 19.7817 15.1355 34.7793 27.2389 32.8970 19.2399 32.5339 2.7022 4.6723 23.4547 181.7715 12.3839 37.4962 5.8402 1.3723 4.3601 0.7277 24.3508 16.5083 5.6957 10.7401 12.5414 8.5929 3.4044 20.3402 9.6520 2.9598 2.3440 43.9875 62.5030 7.2965 15.7834 38.6394 26.2487 7.2820 25.3920 0.4619 70.6646 13.1095 79.4736 46.1514 32.4427 30.8137 25.4417 17.3530 36.5649 19.2572 11.8496 55.9958 31.4534 9.7132 0.2759 3.4197 12.7750 10.0925 29.1501 31.5055 8.5409 31.4645 22.2863 5.9122
temp: 298.150 k
press: 1.00000 atm
elementType: 17 8 7 6 6 6 6 6 6 6 6 6 6 6 6 6 6 6 6 6 6 1 1 1 1 1 1 1 1 1 1 1 1 1 1 1 1 1 1 1 1 1 1
symmnumber: 1
zpe: 935167.1 jmol-1
zpe.correction: 0.356186 hartree
zpe.thermalcorrener: 0.377214 hartree
zpe.thermalcorrenthalpy: 0.378158 hartree
zpe.thermalcorrgfe: 0.301583 hartree
zpe.sumelectzpe: -1287.563445 hartree
zpe.sumelectthermal: -1287.542418 hartree
zpe.sumelectthermalent: -1287.541473 hartree
zpe.sumelectthermalfe: -1287.618048 hartree
dipole: 1.4150 1.0730 3.9234
dipole: 4.3066
quadrupole: -130.1327 -135.2471 -127.8832
quadrupole: -3.5878 -8.3673 -11.1143
quadrupole: 0.9550 -4.1595 3.2045 -3.5878 -8.3673 -11.1143
hfenergy: -1287.9196316 hartree
pointgroup: C01 [X(C18H22Cl1N1O1)]
dipole: 0.5616432 -0.065091 -1.5972106 debye
polarizability: 227.9161734|-17.3621791|201.0840315|8.7329569|-15.1703485|198.4761417 unknown
InChI: InChI=1S/C18H22ClNO/c1-16(15-21-18-10-6-3-7-11-18)20(13-12-19)14-17-8-4-2-5-9-17/h2-11,16H,12-15H2,1H3
charge 0 multiplicity 1
43 atoms
Cl -2.762212 2.270632 3.279579
O  1.431618 1.092636 0.2317
N  -1.409758 1.44288 -0.55752
C  -0.29155 2.315082 -0.96353
C  -1.963636 0.474465 -1.513344
C  -2.287228 1.924089 0.518187
C  1.030926 1.536633 -1.111406
C  -0.571093 3.144291 -2.249856
C  -2.192524 -0.923134 -0.927764
C  -1.72408 1.49357 1.88419
C  -1.221556 -1.51744 -0.081637
C  -3.354558 -1.660261 -1.261547
C  2.618147 0.346649 0.353835
C  -1.406449 -2.82765 0.410906
C  -3.54389 -2.9721 -0.767006
C  -2.568377 -3.560763 0.069298
C  3.452355 -0.015957 -0.733116
C  2.952916 -0.043411 1.674939
C  4.621394 -0.773017 -0.483256
C  4.120863 -0.795816 1.9061
C  4.963565 -1.166607 0.828513
H  -0.136643 3.027361 -0.130248
H  -2.919569 0.831867 -1.963909
H  -1.248586 0.383819 -2.355517
H  -3.2997 1.4984 0.393304
H  -2.397147 3.029545 0.500078
H  0.903498 0.658917 -1.778945
H  1.816897 2.194852 -1.536116
H  0.229912 3.884983 -2.430849
H  -0.646396 2.500676 -3.146051
H  -1.524939 3.69073 -2.143685
H  -0.696035 1.850764 2.041042
H  -1.786791 0.407043 2.032119
H  -0.333767 -0.936419 0.195624
H  -4.117181 -1.206194 -1.907743
H  -0.646753 -3.277111 1.060718
H  -4.450757 -3.529418 -1.02847
H  -2.713668 -4.575977 0.455563
H  3.209062 0.27825 -1.758295
H  2.291516 0.25305 2.495251
H  5.265051 -1.053699 -1.324745
H  4.374955 -1.093608 2.92947
H  5.870666 -1.751804 1.011639
