program: Gaussian 09
title: 000070372
version: EM64L-G09RevD.01
frameworkgroup: C1[X(C11H14O5)]
method: RPBEPBE
basis: SDD
operation: Freq
keyword: #pfreq=noraman
keyword: PBEPBE/SDD
title: #p freq=noraman PBEPBE/SDD
converged: YES YES NO NO
title: Mulliken charges:
elementType: O O O O O C C C C C C C C C C C H H H H H H H H H H H H H H
charge: -0.294384 -0.284908 -0.288786 -0.405378 -0.244770 0.544202 -0.527150 -0.620223 0.043774 0.266433 0.291907 -0.622585 0.211073 -0.521706 -0.498490 -0.535157 0.276636 0.260697 0.249473 0.247163 0.228603 0.201614 0.265421 0.203785 0.252876 0.225549 0.229233 0.229364 0.240417 0.375318
chargesum: 0.00000
title: Mulliken charges with hydrogens summed into heavy atoms:
elementType: O O O O O C C C C C C C C C C C
charge: -0.294384 -0.284908 -0.288786 -0.030060 -0.244770 0.544202 -0.250514 -0.359526 0.043774 0.266433 0.291907 -0.125950 0.211073 0.173932 0.183721 0.163856
polarizability: 1.76246683e+02 -3.49259144e+00 1.60075042e+02 7.16736669e+00 1.98595329e+00 8.67590095e+01
1716.lowfreq: -9.8964 -5.2733 0.0004 0.0005 0.0007 2.2240 23.1087 31.5326 44.9867
frequency: 22.9289 31.4756 44.9516 69.6215 83.3327 100.7813 116.2033 150.9786 177.0288 183.6581 197.2338 210.3158 226.1026 233.2358 270.6779 305.5683 312.1769 376.7795 379.8886 418.8849 455.1050 485.1428 520.0947 544.7130 576.5409 587.9215 643.0194 652.7566 697.4592 737.5939 757.5245 832.3949 856.9821 863.1484 884.8903 927.6599 940.5333 948.8927 1018.2461 1060.1638 1076.1757 1107.9954 1108.6208 1112.6626 1128.1305 1154.1436 1155.4771 1159.0106 1182.8062 1199.3971 1230.9389 1268.4874 1304.4219 1330.4586 1384.1340 1409.0329 1418.9295 1441.6680 1446.4076 1450.4311 1452.8488 1454.3543 1465.2460 1469.2248 1470.5356 1482.7047 1484.0606 1583.9069 1609.0442 1657.4120 2963.4291 2966.6111 2975.9773 3005.5189 3057.1938 3075.9546 3086.3869 3104.7083 3122.3403 3123.7672 3125.0421 3160.2724 3167.2927 3502.7115
redmass: 4.8957 8.2491 3.1619 4.6635 3.4788 1.7723 4.0800 1.5459 1.8686 1.9894 2.0963 2.6820 4.5307 2.8276 1.8103 5.2738 3.5268 3.1822 4.5746 4.5341 4.5876 4.0889 4.9819 4.5916 3.7210 3.5807 3.7432 1.7094 3.7218 5.4275 3.5385 2.2396 1.4905 6.1185 3.0078 6.4952 2.2455 7.3716 5.0162 2.2963 3.7505 1.2482 1.2468 1.2579 2.4136 1.3879 1.4804 1.5557 1.3287 1.7701 1.5790 1.4540 6.4614 2.2885 6.6708 1.7305 1.2413 1.2039 1.3369 1.1358 1.1081 1.1953 1.0511 1.3412 1.0984 1.5948 1.1121 7.2160 6.6733 8.4454 1.0362 1.0325 1.0348 1.0646 1.1042 1.0949 1.0965 1.0970 1.1047 1.1055 1.1004 1.0919 1.0913 1.0638
irintensity: 0.4062 2.2316 4.2218 9.7409 0.7494 2.7500 5.9625 0.2724 3.6539 0.6485 1.2547 1.2091 1.9435 3.3894 0.0534 6.8339 2.5665 4.9558 3.1690 8.0081 1.5906 5.7047 14.0314 51.1722 13.1545 8.0198 9.3942 151.4056 16.5169 5.3845 13.3901 48.9798 1.2439 15.2093 21.1231 0.9673 19.9209 50.5443 33.1476 207.6044 278.5731 12.8369 4.0210 0.1181 16.5491 10.8881 2.7322 56.5218 9.6749 60.3223 49.2352 6.9489 99.0928 95.7180 7.7856 77.8294 10.3020 1.5722 37.7039 44.6848 19.6227 9.7380 14.4767 73.6912 30.9975 61.5065 8.6635 124.6347 54.1666 192.0694 88.1998 50.0368 80.6197 13.4934 39.6037 37.3448 48.0597 5.2563 16.6564 18.7107 25.5646 3.2374 0.5687 21.2524
temp: 298.150 k
press: 1.00000 atm
elementType: 8 8 8 8 8 6 6 6 6 6 6 6 6 6 6 6 1 1 1 1 1 1 1 1 1 1 1 1 1 1
symmnumber: 1
zpe: 613316.3 jmol-1
zpe.correction: 0.233600 hartree
zpe.thermalcorrener: 0.250862 hartree
zpe.thermalcorrenthalpy: 0.251807 hartree
zpe.thermalcorrgfe: 0.186889 hartree
zpe.sumelectzpe: -802.423328 hartree
zpe.sumelectthermal: -802.406065 hartree
zpe.sumelectthermalent: -802.405121 hartree
zpe.sumelectthermalfe: -802.470038 hartree
dipole: 0.0262 1.0414 1.9594
dipole: 2.2192
quadrupole: -84.6986 -88.2445 -90.8314
quadrupole: 2.4534 6.0765 -1.5882
quadrupole: 3.2263 -0.3197 -2.9066 2.4534 6.0765 -1.5882
hfenergy: -802.6569275 hartree
pointgroup: C01 [X(C11H14O5)]
dipole: -0.0221958 0.3289161 -0.808452 debye
polarizability: 171.4653694|8.0371009|161.9408572|15.5509455|-5.8940398|89.6745075 unknown
InChI: InChI=1S/C11H14O5/c1-14-8-4-7(6-10(12)13)5-9(15-2)11(8)16-3/h4-5,12H,6H2,1-3H3
charge 0 multiplicity 1
30 atoms
O  -2.828783 -0.257609 -0.211507
O  -1.273423 -2.693745 0.356628
O  -1.484249 2.168826 -0.278899
O  4.507324 -0.326986 -0.646985
O  3.678805 1.808817 -0.27944
C  1.337106 -0.125746 0.664289
C  0.653975 1.073995 0.341272
C  0.649686 -1.350077 0.640837
C  -1.432977 -0.21082 -0.014832
C  -0.727554 -1.406034 0.297552
C  -0.71618 1.028117 0.01337
C  2.815531 -0.088943 1.061488
C  3.676097 0.590521 0.008788
C  -3.335977 0.247507 -1.505424
C  -2.479798 -3.045522 -0.411614
C  -0.822454 3.47268 -0.169884
H  1.203052 2.019396 0.346887
H  1.151224 -2.294264 0.872841
H  3.19185 -1.108474 1.232967
H  2.933767 0.490844 1.996848
H  -4.426612 0.102749 -1.462708
H  -2.909027 -0.337702 -2.344642
H  -3.093342 1.31566 -1.625947
H  -2.378332 -2.742641 -1.471663
H  -3.378372 -2.578647 0.019791
H  -2.534452 -4.14358 -0.342878
H  0.009519 3.565243 -0.893949
H  -0.441316 3.640386 0.855377
H  -1.604661 4.21025 -0.402605
H  5.038074 0.149499 -1.342957
