program: Gaussian 16
title: Title
version: ES64L-G16RevC.02
method: RB3LYP
basis: 6-311++G(2d,2p)
operation: Freq
keyword: #P
keyword: Geom=AllCheck
keyword: Guess=TCheck
keyword: SCRF=Check
keyword: Test
keyword: GenChkRB3LYP/6-311++G(2d,2p)
keyword: Freq
converged: YES YES YES YES
title: Mulliken charges:
elementType: O H H O H H O H H C C O O H H H C C O O H H H C C O O H H H H P P P C O O O O O O O O O O H H H Mg H H H C H C H H H O H C H C H H H O H C H C H H H O H K
charge: -0.372798 0.304090 0.321771 -0.588905 0.246275 0.349592 -0.529096 0.314873 0.307907 -0.175710 0.492579 -0.823420 -0.636874 0.074456 0.094648 0.147076 -0.207835 0.649465 -0.749867 -0.666726 0.110226 0.076297 0.101717 -0.275933 0.442572 -0.553440 -0.441946 0.101926 0.121348 0.197442 0.457628 1.422467 1.479188 0.700306 -0.052419 -0.536004 -1.018671 -0.731653 -0.591766 -0.729184 -0.842264 -0.466425 -0.609829 -0.752337 -0.617939 0.124793 0.103018 0.120753 0.397816 0.089757 0.087862 0.085891 0.112096 0.074503 -0.315432 0.092647 0.099354 0.087687 -0.449982 0.260197 -0.050494 0.084846 -0.208334 0.130842 0.063928 0.063650 -0.545126 0.341126 0.181651 0.110781 -0.409458 0.096768 0.091091 0.088071 -0.598798 0.213444 0.832245
chargesum: -3.00000
polarizability: 4.37520154e+02 -3.71966055e+00 4.76269395e+02 -3.69849407e+00 1.30074885e+01 4.48676783e+02
frequency: -52.3292 22.4038 36.2241 46.1904 54.7068 64.1146 68.6172 69.8954 76.7797 80.7806 81.0516 90.8883 95.9078 102.2569 105.4867 113.0408 118.0618 118.3787 128.2486 131.5741 134.0173 139.6958 154.5045 159.0769 167.4909 170.3920 176.2953 177.9442 188.4403 191.3761 204.2051 206.7403 215.7464 218.6984 225.6023 231.4831 235.9872 246.4974 254.5133 259.0501 260.2849 263.9792 271.4490 290.4101 292.5994 299.8251 308.5542 319.4278 329.6922 331.7311 341.2518 358.4922 361.9583 367.8356 386.4994 405.7740 411.2193 420.5079 432.0034 439.5029 446.7036 462.7742 484.4340 498.5567 501.0867 510.1069 515.9547 519.6326 530.2144 546.9882 560.7276 631.4399 634.0557 635.0996 637.0959 655.7838 664.1684 669.6084 674.4722 675.4463 690.5212 720.7290 727.5235 732.6879 734.2323 738.0291 745.7469 755.2995 756.2296 761.1766 779.5001 816.8506 828.9419 855.0023 896.9214 952.7689 963.8940 971.8729 975.5358 983.0718 985.3061 994.0677 1015.8075 1018.1610 1022.4809 1023.7006 1061.7769 1065.4396 1085.5955 1110.4216 1116.9103 1134.9223 1149.2747 1150.2590 1168.2725 1179.7743 1181.9701 1196.1172 1204.1868 1211.6952 1224.1621 1228.6168 1229.4346 1247.0704 1262.5536 1279.0127 1307.0364 1334.2365 1351.6820 1378.5284 1397.5628 1397.5869 1399.1401 1402.3701 1405.4068 1408.0300 1408.2391 1419.5740 1460.4516 1462.9492 1477.8398 1479.1696 1482.8886 1484.8577 1490.8169 1508.2297 1515.8468 1562.3512 1586.1817 1653.2930 1659.4568 1689.5950 1699.0614 2900.7073 2907.0880 2918.1745 2950.8469 2956.5099 2958.1043 2962.6536 2973.5383 2992.3145 2998.1705 3007.8452 3012.0515 3016.3625 3020.2197 3030.0670 3035.8389 3048.1504 3066.4684 3077.6373 3087.6476 3097.0886 3102.3953 3104.5886 3161.1720 3389.1707 3522.9822 3681.2020 3726.6221 3835.9806 3851.5252
redmass: 13.3637 14.2115 12.7215 12.1124 13.0283 12.0762 12.6884 11.2889 9.6240 3.4051 9.7752 7.1657 10.5375 6.0183 5.7398 7.3728 9.9620 8.6184 9.3696 5.5521 9.3980 8.0903 10.8211 8.7197 2.8655 6.0212 7.8309 4.9750 8.1499 5.2017 4.7590 4.9669 2.0113 2.9291 7.4186 9.4396 2.7751 1.5740 11.3093 6.1996 1.3358 4.1945 1.9669 4.1117 5.2727 5.7271 1.1445 8.6539 3.8324 3.6321 14.1899 8.4960 4.4278 9.7667 11.2369 9.6408 2.4209 3.3873 7.4279 6.8810 5.8900 15.3272 4.7130 1.1781 9.2040 11.3956 1.3329 6.6821 12.5866 10.8100 1.2123 1.3101 1.2991 4.2942 1.2475 4.1761 4.0764 5.3769 1.2360 3.6091 1.1487 5.1325 5.1436 5.5079 1.1446 1.1041 2.5594 3.3180 1.0618 3.9972 5.1406 5.9776 9.3157 9.3425 12.7599 1.1623 1.1742 1.1681 1.6299 2.7886 13.3650 1.1118 1.3091 1.2994 1.1588 1.2905 14.6080 1.0827 13.4337 1.0861 1.0756 1.0938 1.3207 4.3631 1.0854 12.6033 1.0929 15.1737 1.1200 1.0671 1.0626 1.1248 1.0615 15.1324 1.0455 3.1144 1.1013 1.0624 7.8273 1.0698 1.2935 4.7315 1.2328 1.0629 1.1106 1.2312 1.0278 1.0806 1.0258 1.4941 1.0964 1.0368 1.0405 1.0470 1.0444 1.0479 1.0432 8.9404 9.4656 1.0791 1.0835 7.1305 1.0812 1.0774 1.0083 1.0088 1.0081 1.0080 1.0083 1.0081 1.0079 1.0080 1.0081 1.0080 1.0361 1.0087 1.0371 1.0353 1.0725 1.0722 1.0999 1.0977 1.1009 1.1008 1.1021 1.1018 1.0702 1.0720 1.0611 1.0642 1.0695 1.0666 1.0659
irintensity: 84.9075 8.9334 35.3014 0.8966 20.3698 8.0705 26.3863 19.7790 25.6081 2.3116 15.2734 6.5919 59.8826 0.9252 6.4068 5.6250 32.8367 26.1257 8.9394 21.8929 24.4787 35.9379 5.8989 8.5152 2.8444 6.3526 26.8972 16.0724 3.5463 2.5398 3.3436 5.9051 4.9095 26.9670 10.1821 19.3219 22.1894 1.7775 17.4931 18.2728 38.9452 20.5675 18.0809 7.5133 12.3778 35.6147 62.7251 10.2317 26.6826 6.5892 5.1915 6.7391 27.7770 33.1820 18.1258 17.3126 121.5000 56.7450 6.9211 163.4218 160.5499 115.2440 73.1694 62.6235 1.1872 68.3653 19.8657 271.9284 104.1172 31.7170 124.0624 138.0379 272.5873 249.1779 1.8264 27.4777 26.5504 32.8868 143.7350 5.7134 404.6909 17.3437 34.9616 33.8529 6.8413 48.2037 28.9866 8.4140 127.1492 40.9343 77.7629 133.7230 17.5453 562.3973 456.2404 114.7110 4.2824 9.1286 56.1364 3.9908 20.9073 258.8692 5.4797 1.2522 165.9198 2.6197 331.4931 49.5672 438.1164 13.5995 10.1786 45.0032 54.2025 681.9929 68.5656 394.1456 160.6496 902.2815 12.3060 6.3619 0.4558 78.3367 14.1924 318.5710 13.8166 638.3540 48.2007 0.3613 556.9643 32.9982 10.2480 317.3756 24.4459 7.4284 44.7205 6.9056 8.8051 102.0175 10.7849 16.0210 95.2548 5.4962 9.4211 6.9923 8.1916 6.4024 4.7373 963.1421 972.7723 96.6783 98.9357 645.1260 128.6930 1982.0713 65.5843 28.6569 35.3060 0.3764 54.8623 27.5820 22.0762 48.4137 5.7694 30.6814 86.6092 50.1437 159.1519 24.6249 2193.2557 2343.8166 68.2224 112.6980 42.5106 38.0995 30.6332 0.8136 1459.3243 1264.6689 879.7088 289.3294 412.7745 77.9171 85.7673
temp: 298.150 k
press: 1.00000 atm
elementType: 8 1 1 8 1 1 8 1 1 6 6 8 8 1 1 1 6 6 8 8 1 1 1 6 6 8 8 1 1 1 1 15 15 15 6 8 8 8 8 8 8 8 8 8 8 1 1 1 12 1 1 1 6 1 6 1 1 1 8 1 6 1 6 1 1 1 8 1 6 1 6 1 1 1 8 1 19
symmnumber: 1
zpe: 1220542.3 jmol-1
zpe.correction: 0.464880 hartree
zpe.thermalcorrener: 0.506956 hartree
zpe.thermalcorrenthalpy: 0.507900 hartree
zpe.thermalcorrgfe: 0.391915 hartree
zpe.sumelectzpe: -3998.243092 hartree
zpe.sumelectthermal: -3998.201016 hartree
zpe.sumelectthermalent: -3998.200072 hartree
zpe.sumelectthermalfe: -3998.316057 hartree
dipole: -1061.1274 -553.7885 -1157.8660
dipole: 1665.3309
quadrupole: -78504.6257 -21675.7482 -93393.2878
quadrupole: -40769.5426 -85297.7864 -44409.2674
quadrupole: -13980.0718 42848.8057 -28868.7339 -40769.5426 -85297.7864 -44409.2674
hfenergy: -3998.7079723 hartree
pointgroup: C01 [X(C13H37K1Mg1O22P3)]
dipole: -2.3139077 6.145943 4.0032729 debye
polarizability: 437.5201535|-3.7196606|476.2693954|-3.6984941|13.0074885|448.6767834 unknown
InChI: InChI=1/C2H4O2.2C2H3O2.3C2H6O.CH3O7P2.K.Mg.O3P.3H2O/c3*1-2(3)4;3*1-2-3;1-7-10(5,6)8-9(2,3)4;;;1-4(2)3;;;/h3H,1H3;2*1H3;3*3H,2H2,1H3;1H3;;;;3*1H2/q;;-1;;;;-3;+1;+4;-1;;;/rC7H22KMgO16P3.C2H4O2.C2H3O2.C2H6O.H2O/c1-5-18-8(19-6-2)21-28(17-4)24-9(11,12,20-7(3)10,22-26(13)14)23-27(15,16)25-28;2*1-2(3)4;1-2-3;/h18-19H,5-6,11-12H2,1-4H3;3H,1H3;1H3;3H,2H2,1H3;1H2
charge -3 multiplicity 1
77 atoms
O  73.84575319 40.40198481 77.68299836
H  73.2623215 41.21548654 77.60861141
H  74.69824188 40.625064 77.29671047
O  72.02814091 35.05951651 80.60498338
H  72.73022362 35.09307998 81.27510698
H  72.51355971 34.78277442 79.7798205
O  70.34778557 37.6954774 79.70173539
H  70.23360019 38.43440379 79.07165754
H  70.06974251 38.0251122 80.56952745
C  73.23602 43.91995 78.73704
C  72.02996105 43.46468078 77.90574342
O  72.14757916 42.34500316 77.28382801
O  71.03001743 44.19980405 77.85397318
H  72.93698 44.15104 79.75999
H  73.63160058 44.83836981 78.29964356
H  74.01762959 43.16727498 78.77741738
C  74.47601 35.99199 76.73706
C  73.61193171 35.76771444 77.98306539
O  73.03167874 36.77119328 78.48291674
O  73.50060032 34.58549435 78.41319356
H  75.29899 36.69001 76.89099
H  73.84881506 36.42147875 75.95296314
H  74.87898628 35.04551936 76.38233669
C  70.08703 38.19897 76.08402
C  70.32749171 39.55677904 76.69537498
O  70.04119901 39.7740443 77.86452555
O  70.88282968 40.46744046 75.91506328
H  70.22497 38.09603 75.00799
H  69.08145695 37.87690785 76.34929204
H  70.77852376 37.51121051 76.57615569
H  71.18209974 41.26429739 76.46243908
P  71.65422279 38.06019403 83.59569288
P  74.54324227 37.41132763 82.85991318
P  74.43242016 39.75520369 79.70053408
C  71.40101 35.46301 83.91197
O  71.09226314 36.7733006 84.43473892
O  71.27676828 37.84225204 82.14007365
O  73.86587721 36.66769896 81.69263541
O  74.74701779 41.12523158 80.22663219
O  71.13443814 39.29883436 84.26460583
O  75.29870527 36.50904836 83.8007117
O  73.08715875 39.18501899 80.06492267
O  73.22688698 37.98199678 83.81268511
O  75.23646294 38.69629598 82.43880866
O  75.5268676 38.9118066 79.15358717
H  71.4570 34.77702 84.75701
H  72.36601744 35.46093982 83.41188628
H  70.62765153 35.14457361 83.21571496
Mg 72.35999 37.28901 80.46294
H  71.26747 44.03766 86.90469
H  78.45095 40.33279 80.80731
H  76.77062 40.58113 84.80863
C  71.7191 44.26505 85.93902
H  70.95326941 44.09807517 85.18184947
C  72.18817175 45.71160768 85.90014512
H  72.95207029 45.89390753 86.65849001
H  72.60691723 45.95676162 84.92427871
H  71.35243341 46.38509702 86.09705344
O  72.76113587 43.34090576 85.64354111
H  73.46399761 43.41841017 86.29461796
C  78.40597 41.1660 80.1060
H  79.31916408 41.74696799 80.26460761
C  78.37583354 40.64420886 78.67437432
H  77.47897205 40.04769137 78.5103191
H  78.39087628 41.47480286 77.96538798
H  79.24975237 40.01530561 78.48331059
O  77.33678035 42.05200824 80.40948967
H  76.4686553 41.59638222 80.32484446
C  75.6830 40.60402 84.87698
H  75.37410052 39.58447393 85.1227924
C  75.31885398 41.52680419 86.02961916
H  74.26208654 41.44384071 86.28110644
H  75.89510914 41.25417236 86.91567088
H  75.55257734 42.56521846 85.78285393
O  75.06776928 41.00380315 83.66799216
H  75.09029782 40.184876 83.0895492
K  72.44197 41.79299 83.54204
