program: Gaussian 16
title: Title
version: ES64L-G16RevC.02
method: RB3LYP
basis: 6-311++G(2d,2p)
operation: Freq
keyword: #P
keyword: Geom=AllCheck
keyword: Guess=TCheck
keyword: SCRF=Check
keyword: Test
keyword: GenChkRB3LYP/6-311++G(2d,2p)
keyword: Freq
converged: YES YES NO YES
title: Mulliken charges:
elementType: C C O O H H C C O O H H C C O O H H P P P C O O O O O O O O O O H H Mg O H H O H H O H H H H H H H H H C H C H H H O H C H C H H H O H C H C H H H O H K
charge: -0.177752 0.315006 -0.726711 -0.730839 0.067466 0.133271 -0.586333 0.763002 -0.640105 -0.639677 0.105496 0.101348 -0.329525 0.407616 -0.577737 -0.481664 0.118023 0.107628 1.273079 1.695577 1.079298 -0.068123 -0.570186 -0.903927 -0.921838 -0.703555 -0.750467 -0.956419 -0.786636 -0.609099 -0.704201 -0.670618 0.107674 0.118600 0.551820 -0.391593 0.286491 0.192026 -0.610195 0.589659 0.290434 -0.522098 0.339126 0.309243 0.129402 0.126948 0.115920 0.087103 0.084670 0.073544 0.087717 0.152723 0.079893 -0.348152 0.085186 0.114303 0.085305 -0.415461 0.253265 0.039915 0.071044 -0.279164 0.075382 0.060415 0.124793 -0.546420 0.353939 0.213401 0.105515 -0.383592 0.081068 0.082771 0.093472 -0.524546 0.104571 0.722487
chargesum: -4.00000
polarizability: 4.58013185e+02 -8.90201321e+00 4.48382270e+02 1.05387817e+00 -1.53232756e+01 4.61820995e+02
frequency: 20.4720 29.9525 31.9307 37.3101 47.1418 52.9355 56.1780 57.7819 68.7485 71.7151 72.9983 74.7816 78.6409 92.7436 95.4840 98.0188 108.9049 121.9979 127.6621 132.4697 138.5141 151.0473 152.5765 156.0251 166.2328 169.1025 170.1497 180.6598 184.4587 191.4969 196.0846 205.1348 205.6505 210.1701 218.3411 226.3264 233.8850 236.5598 247.2059 249.8332 261.8045 271.0589 271.9600 281.7122 288.5277 315.2664 327.7653 332.8804 341.3852 341.9714 352.7531 355.3362 381.3984 388.6559 405.1112 406.6228 421.8839 466.6246 476.5469 485.4217 491.1152 492.6153 501.5865 502.4702 507.1684 510.3932 523.2721 527.2287 529.8412 555.7859 561.8311 566.6980 637.0611 638.6934 648.1368 655.0645 665.6980 675.7217 678.1661 716.3424 724.0094 724.6867 725.5096 735.2394 749.9124 759.1807 760.6046 777.6355 793.8414 815.8235 825.2206 839.6443 851.8462 888.1265 914.0824 935.7767 958.0396 962.9560 970.3309 976.1452 977.5316 1011.7001 1014.6205 1023.5583 1027.7445 1061.0504 1084.6094 1091.0535 1093.5228 1124.0745 1128.4353 1132.8001 1141.0696 1144.7154 1146.6593 1184.5165 1193.6067 1194.5329 1198.0656 1207.3463 1219.1226 1230.0876 1238.6357 1285.7421 1301.7031 1307.1500 1321.1236 1367.5301 1382.8753 1393.9834 1395.2568 1395.9459 1399.4578 1401.4890 1407.6936 1408.2030 1452.7897 1458.2546 1464.2180 1477.0025 1479.0392 1483.3652 1490.7495 1494.8850 1512.2816 1530.8646 1541.1533 1592.7648 1641.1256 1690.5978 1722.2006 2550.3049 2896.0615 2906.8074 2935.6066 2953.8750 2958.0057 2958.2181 2961.4511 2967.0378 2985.3893 2988.6034 3010.0071 3017.7919 3026.3519 3027.7098 3073.5475 3078.1920 3084.1487 3099.5589 3104.1299 3110.1333 3164.8529 3241.9907 3376.9166 3540.5003 3656.9472 3676.5052 3834.4424 3847.9987
redmass: 14.3370 13.9821 11.4868 11.3784 11.7038 7.6545 11.6620 10.5989 12.1999 14.8946 3.3722 6.6752 8.4358 9.7970 8.0031 10.0646 4.8607 7.7224 4.9852 12.1505 6.2447 6.8534 8.4993 7.6610 2.8529 2.8283 12.2689 7.1489 8.7641 10.5033 3.0932 1.2007 6.6637 6.5345 1.6894 1.2261 6.5840 3.4329 8.8065 1.9614 1.4563 1.9512 3.9311 3.2299 13.6895 11.0220 3.7853 3.9254 14.2243 14.0303 4.5038 10.6906 6.3572 11.8973 5.5469 5.8260 9.3272 7.4357 16.0130 2.9448 9.9085 1.6007 1.5385 1.5672 3.5653 9.2948 15.2020 9.2226 7.7086 2.7198 1.5465 1.2869 5.0400 9.7749 1.2618 3.9698 4.1535 5.3477 4.2357 1.1117 5.5052 5.0688 1.1833 5.6975 2.5702 2.7992 1.4358 1.7654 6.0331 13.3863 2.9535 1.0538 8.6665 12.7145 1.1376 1.4446 1.1754 1.1737 1.2594 15.5968 6.4158 1.3141 1.3044 1.3043 1.4588 14.0242 3.8801 1.6513 1.0564 3.0848 1.1752 1.0361 16.3740 2.8608 1.3949 1.0713 11.5446 1.1649 1.1360 1.0631 1.0613 1.1243 1.0605 7.0128 1.0331 1.0852 1.0639 7.6235 1.0775 1.2309 1.2219 1.2225 1.0388 1.0957 1.2327 4.1858 1.0678 1.1013 1.0296 1.0441 1.0441 1.0406 1.0445 1.0465 1.0433 1.2543 9.3020 3.6561 1.3029 1.0952 5.4507 1.0918 1.0083 1.0081 1.0080 1.0080 1.0080 1.0081 1.0080 1.0080 1.0080 1.0080 1.0080 1.0372 1.0364 1.0364 1.0990 1.1008 1.0997 1.1009 1.1018 1.0988 1.0711 1.0743 1.0655 1.0536 1.0780 1.0668 1.0667 1.0653
irintensity: 14.0540 8.4497 30.8908 8.0090 35.3037 1.9645 21.3194 11.3228 12.6321 31.7794 2.0788 11.6096 18.9350 16.3397 26.2878 23.2756 14.2898 18.6740 24.8909 11.2053 10.1153 18.8647 19.3678 20.8270 1.7698 1.3615 9.3603 39.1323 25.1780 9.4915 16.5978 68.1554 18.9977 22.8336 12.9336 3.9543 38.7002 14.2850 4.5629 93.6643 3.2660 10.0766 32.3822 12.3097 1.2786 5.3555 12.7881 4.4561 6.6719 22.8232 26.8069 9.2321 8.2224 0.8143 28.2571 9.8645 64.7787 176.6669 43.6919 45.8560 40.9134 17.8838 36.5304 46.7892 36.9638 64.2308 322.5658 172.0245 116.3666 69.9394 83.1573 1.7475 286.1577 466.1100 240.1852 30.7963 25.2119 31.5367 31.0880 150.4293 26.8377 29.8303 0.3120 30.9631 12.9029 15.6594 115.6019 70.0959 73.3910 44.7000 122.8135 166.6938 565.0021 451.2695 98.9161 133.4168 4.5017 3.8428 3.7995 153.9811 35.1975 2.1693 6.7768 2.1920 181.9694 271.2784 117.0730 516.0444 2.1504 568.6501 105.2672 4.4441 639.4244 498.6327 253.1687 88.6880 781.1359 37.3771 1.5199 7.6509 3.7978 89.8890 17.8410 514.5775 9.7099 20.1698 0.8358 300.9180 32.2580 5.5139 141.3567 5.2512 37.7336 56.5146 6.7381 312.9846 64.8748 102.9150 11.6599 13.4614 6.3237 10.4383 7.6602 6.7814 4.3627 16.3232 1012.8378 531.9215 171.3849 219.3037 483.0367 3532.1918 43.4361 137.4123 23.8381 27.3368 36.8323 27.7178 6.3163 29.2629 41.2536 10.8247 27.6699 57.3765 61.9474 30.9532 60.1798 58.0757 43.4315 30.5541 28.1711 37.4108 1729.2139 1631.6522 711.9427 397.1107 665.5366 393.6420 58.0533 81.9055
temp: 298.150 k
press: 1.00000 atm
elementType: 6 6 8 8 1 1 6 6 8 8 1 1 6 6 8 8 1 1 15 15 15 6 8 8 8 8 8 8 8 8 8 8 1 1 12 8 1 1 8 1 1 8 1 1 1 1 1 1 1 1 1 6 1 6 1 1 1 8 1 6 1 6 1 1 1 8 1 6 1 6 1 1 1 8 1 19
symmnumber: 1
zpe: 1187396.0 jmol-1
zpe.correction: 0.452255 hartree
zpe.thermalcorrener: 0.495128 hartree
zpe.thermalcorrenthalpy: 0.496072 hartree
zpe.thermalcorrgfe: 0.375681 hartree
zpe.sumelectzpe: -3997.736492 hartree
zpe.sumelectthermal: -3997.693619 hartree
zpe.sumelectthermalent: -3997.692675 hartree
zpe.sumelectthermalfe: -3997.813066 hartree
dipole: -2436.1473 -1126.1042 -2308.9449
dipole: 3540.3602
quadrupole: -309325.7688 -66545.4375 -277903.0107
quadrupole: -142677.2004 -292686.2779 -135481.4679
quadrupole: -91401.0298 151379.3015 -59978.2717 -142677.2004 -292686.2779 -135481.4679
hfenergy: -3998.1887471 hartree
pointgroup: C01 [X(C13H36K1Mg1O22P3)]
dipole: 3.7260769 -2.8910925 -5.625008 debye
polarizability: 458.0131846|-8.9020132|448.3822698|1.0538782|-15.3232756|461.8209955 unknown
InChI: InChI=1/C2H4O2.2C2H3O2.3C2H6O.CH3O7P2.K.Mg.HO4P.2H2O/c3*1-2(3)4;3*1-2-3;1-7-10(5,6)8-9(2,3)4;;;1-5(2,3)4;;/h3H,1H3;2*1H3;3*3H,2H2,1H3;1H3;;;1H;2*1H2/q;;-1;;;;-3;+2;+4;-2;;/rC7H21KMgO16P3.C2H4O2.C2H3O2.C2H6O.H2O/c1-5-17-8(18-6-2)20-26(12,13)22-9(11,19-7(3)10)23-27(14,15)25-28(16-4,21-8)24-9;2*1-2(3)4;1-2-3;/h12,17-18H,5-6,11H2,1-4H3;3H,1H3;1H3;3H,2H2,1H3;1H2
charge -4 multiplicity 1
76 atoms
C  124.9007496 62.35910679 122.2761976
C  124.29550963 63.72444782 122.64991689
O  124.52581153 64.69047156 121.86955488
O  123.63535844 63.78938609 123.72527476
H  124.30017618 61.54344504 122.67619866
H  125.89418994 62.28177934 122.72160423
C  129.03098725 55.06595713 123.79595433
C  129.64383399 55.65039418 122.55547328
O  128.88915556 55.98709674 121.61820236
O  130.91233165 55.76954536 122.54308008
H  129.33848638 55.67197234 124.65114847
H  129.46726908 54.07815206 123.96471496
C  130.58050029 59.06913936 124.72996674
C  129.17115599 59.26822294 124.25416102
O  129.13359927 59.52863143 122.95525282
O  128.18820555 59.20144033 124.9697448
H  131.14746312 59.98699906 124.56764875
H  131.05883451 58.29136141 124.13447551
P  129.39531001 57.62942274 116.70046265
P  127.66850456 55.30358964 117.62412463
P  126.52896471 58.84877101 120.49889804
C  130.95203198 55.59594851 116.2220034
O  130.40989726 56.82076493 115.70155645
O  130.04578881 57.71414715 118.06668139
O  128.58466097 55.36331347 118.86466002
O  126.04246169 59.93281928 119.56037071
O  129.04189233 58.9103665 116.00487734
O  127.97543499 54.13566276 116.71614254
O  127.93256017 58.34235118 120.15242973
O  128.0860333 56.71337713 116.74034097
O  126.20174404 55.5537612 117.92100973
O  125.50996849 57.79562498 120.90198844
H  130.1990931 55.02953932 116.76300924
H  131.78954603 55.81027563 116.88612328
Mg 129.38405417 56.96823527 119.86695177
O  131.14074459 55.26026783 119.74385646
H  131.13702718 55.12904245 120.7065828
H  130.32973992 54.84998914 119.38510265
O  126.82250804 59.66521236 121.98328695
H  128.16731414 59.57462793 122.59777087
H  126.10610082 59.45605845 122.58989346
O  130.84917949 58.05034986 121.04260589
H  130.31009225 58.65402561 121.58012158
H  131.07995013 57.30770347 121.64769128
H  131.28405622 54.98280073 115.4103879
H  127.9657105 54.9695239 123.82453798
H  130.63128529 58.79800379 125.76391811
H  125.01253781 62.24159658 121.21872581
H  126.38700005 62.42221973 113.69423999
H  122.79664562 55.4147352 120.18681288
H  123.6218495 56.42685034 116.05278922
C  125.89067919 62.29912275 114.65684258
H  126.63575618 62.5146142 115.42275052
C  124.7211168 63.26272721 114.78432718
H  123.96855786 63.06676414 114.01733992
H  124.24916479 63.17118098 115.7622608
H  125.06376192 64.29146247 114.66167668
O  125.51425199 60.9406392 114.85447607
H  124.76134821 60.72960688 114.29550454
C  122.43877803 56.16492646 120.89205958
H  121.34681379 56.15683341 120.82828631
C  122.87200408 55.7787373 122.30366722
H  122.4719713 56.482665 123.03553724
H  122.51431146 54.77662056 122.55480437
H  123.95898068 55.78564244 122.38283456
O  122.84648418 57.46944878 120.519998
H  123.82906602 57.56597535 120.61536948
C  124.44905128 57.09496923 115.81287963
H  125.21750577 56.47198593 115.34312843
C  123.95506075 58.12163577 114.80694124
H  124.79246506 58.67517271 114.38631221
H  123.43316918 57.62135569 113.98846692
H  123.26230834 58.82306264 115.27601792
O  124.97433096 57.71718761 116.96530015
H  125.47886211 57.00046811 117.43869204
K  126.70915322 60.00569424 117.10208249
