program: Gaussian 16
title: Title
version: ES64L-G16RevC.02
method: RB3LYP
basis: 6-311++G(2d,2p)
operation: Freq
keyword: #P
keyword: Geom=AllCheck
keyword: Guess=TCheck
keyword: SCRF=Check
keyword: Test
keyword: GenChkRB3LYP/6-311++G(2d,2p)
keyword: Freq
converged: YES YES YES YES
title: Mulliken charges:
elementType: C C O O H H C C O O H H C C O O H H P P P C O O O O O O O O O O H H Mg O H H O H H O H H H H H H H H H C H C H H H O H C H C H H H O H C H C H H H O H K
charge: -0.147107 0.316289 -0.730242 -0.738372 0.058667 0.138306 -0.508647 0.710297 -0.669922 -0.656243 0.109898 0.100379 -0.316539 0.455261 -0.759075 -0.618210 0.100796 0.095306 1.469363 1.445501 0.708715 -0.077192 -0.540069 -0.915425 -0.776560 -0.685848 -0.733205 -0.822779 -0.560600 -0.663843 -0.749722 -0.493445 0.117990 0.121015 0.540575 -0.462001 0.297505 0.245013 -0.457421 0.490854 0.252006 -0.604951 0.450316 0.280996 0.128593 0.125940 0.103176 0.089497 0.088028 0.067691 0.080004 0.133910 0.080800 -0.344902 0.085828 0.113952 0.084701 -0.430205 0.271518 0.053093 0.074423 -0.310067 0.077806 0.062346 0.132667 -0.524104 0.353678 0.145445 0.100362 -0.389937 0.088358 0.083179 0.092169 -0.564026 0.319339 0.709110
chargesum: -4.00000
polarizability: 4.60688802e+02 -1.17815561e+01 4.46937370e+02 -4.24103110e+00 -6.44022164e+00 4.74731270e+02
frequency: -146.0768 28.8145 30.2218 31.5254 35.8454 44.2014 49.8097 53.2911 70.9920 71.7706 74.0358 76.0643 76.7530 78.1982 92.5370 100.2249 113.3487 115.6408 132.0021 139.1379 145.8151 150.8099 156.2396 166.8347 167.1836 171.1084 175.0358 185.3052 186.8024 190.9730 198.8281 203.5484 207.9114 217.7251 220.2911 221.0864 224.6592 233.0101 235.3669 244.5687 256.5039 263.0575 265.8212 271.9586 282.6690 287.6034 303.1656 318.1867 326.3495 329.7202 338.5051 342.4124 346.4614 373.2042 380.8023 391.9205 405.6387 423.2460 428.1292 467.1542 470.9465 476.1679 487.6462 493.6580 504.2254 511.8481 513.2851 522.4320 532.1183 544.0585 552.6565 560.1712 590.2909 593.7146 602.6478 647.8759 656.6593 661.7701 671.5281 673.3380 714.2023 720.1498 724.7897 731.5110 737.7843 760.7612 761.3078 775.4202 803.3201 816.2185 821.8757 828.7996 838.2958 871.1881 885.1678 913.2637 939.0179 948.0551 958.8764 963.2472 965.6001 966.9430 989.8409 1011.8122 1014.0005 1014.9394 1061.0718 1075.3387 1096.7595 1116.8907 1128.2188 1140.9735 1154.5148 1176.5631 1177.6442 1191.6043 1195.5410 1207.7529 1219.6609 1225.8202 1227.6422 1231.4887 1237.6539 1272.4969 1306.1991 1340.4995 1366.3658 1368.3827 1376.2742 1390.9429 1393.0797 1393.8878 1394.8739 1399.6047 1405.2831 1408.2401 1439.1250 1460.9445 1462.3127 1478.3642 1479.1799 1483.1733 1490.6117 1495.6547 1504.9643 1537.6014 1587.2680 1590.8988 1654.9414 1679.6209 1710.4846 2907.8124 2937.9574 2942.9779 2945.4053 2952.3267 2959.8726 2967.8414 2972.3689 2980.1580 2987.5100 3002.1182 3018.4872 3018.6806 3028.4723 3072.7475 3074.5637 3084.7662 3085.6527 3101.7906 3104.4056 3147.8981 3238.6684 3269.8784 3307.7889 3344.8764 3672.2183 3763.8722 3833.6271 3866.4223
redmass: 18.2387 12.8401 12.8128 16.9989 15.0695 6.7954 10.1972 11.3371 5.4340 8.5574 6.0259 3.3693 11.6492 7.7452 6.4771 12.8677 7.5998 6.6054 7.4983 7.1128 8.4839 8.8715 10.0821 7.6172 3.2173 2.8351 6.9459 9.4618 4.2399 6.3061 5.4552 7.1815 1.2084 3.9660 4.9127 1.9523 1.3647 6.1008 1.9927 4.6528 12.6538 8.2374 1.6996 1.5964 3.9796 8.5602 11.3898 10.3599 3.8792 3.6873 13.9972 14.0716 4.2256 4.9312 11.8880 2.2483 8.3030 7.4584 9.5376 5.0052 3.9241 10.2643 9.0844 2.8625 1.7108 6.4037 1.5801 10.8303 1.9561 2.5461 1.6268 9.9478 1.1044 1.2715 1.1521 10.9095 3.8214 4.3771 4.1482 5.3611 1.1940 4.6762 1.1501 5.8844 6.1741 2.7714 2.9239 2.5291 1.0626 13.4455 3.1910 5.9044 6.9227 1.5984 3.1267 1.1199 1.1183 1.3425 1.1749 1.1742 6.2226 1.3343 14.6492 1.3152 1.3105 1.3096 17.5141 14.6085 1.0721 1.0386 1.0328 1.0999 17.6397 1.0771 1.1257 1.1357 17.9367 1.0784 1.1015 1.1328 11.3320 9.4464 1.0729 1.0456 1.0992 1.0564 9.3599 9.4942 1.0676 1.2436 1.1479 1.2290 1.1250 1.0829 4.0457 1.2320 1.1136 1.0259 1.0682 1.0507 1.0446 1.0403 1.0447 1.0465 1.0438 9.5065 6.2796 6.1756 1.1517 1.1091 1.0831 1.0080 1.0080 1.0080 1.0083 1.0079 1.0081 1.0080 1.0080 1.0080 1.0081 1.0080 1.0350 1.0375 1.0362 1.1001 1.0987 1.1001 1.1010 1.1007 1.1017 1.0693 1.0687 1.0693 1.0669 1.0711 1.0659 1.0668 1.0666 1.0654
irintensity: 362.8144 13.5362 27.8279 13.4147 6.6017 11.7307 1.7444 54.1717 10.3396 7.9450 0.2400 0.2819 10.2450 34.3125 47.8295 48.4582 12.6585 24.4248 19.7136 25.3498 34.2229 13.2902 12.5978 1.2452 3.2660 1.7073 18.7212 10.7672 10.0750 5.6573 11.9488 15.7450 68.8095 1.8817 4.0974 9.2810 2.7354 23.6387 47.8419 8.4581 18.2870 9.9013 2.4190 31.0749 0.1818 13.0784 36.6204 5.2514 12.7051 5.5533 1.7799 26.2664 22.2882 49.1062 8.6261 209.1930 2.6987 122.0882 229.6015 22.4526 11.8286 28.8870 213.4037 25.6302 12.3951 65.7548 14.7271 199.0970 82.8035 139.3535 112.5181 48.3489 49.2182 4.8119 353.3316 188.5212 26.0289 30.7743 14.5288 18.1770 4.1751 17.2753 226.1061 33.1167 39.5853 29.5322 17.6050 18.6825 160.8729 41.4245 130.0529 49.4727 784.9296 202.5252 222.5399 120.8365 185.2821 116.8311 3.8707 3.2790 15.8557 4.0109 17.9623 2.0106 2.6730 4.4835 483.7749 395.3505 5.1636 2.3451 3.1097 15.9024 548.9354 94.1226 3.1405 0.9986 492.2334 5.1013 62.4810 42.6509 771.0435 560.4388 14.9889 17.9216 38.8112 5.7302 443.5500 313.4551 24.6614 7.4644 158.9217 17.3661 7.5040 40.6540 333.4099 6.6844 87.6769 12.1297 70.3498 16.8958 6.7516 10.4378 7.9006 6.0814 4.2474 1000.4932 778.3578 788.5628 101.3704 171.8787 79.9543 120.2645 23.1794 26.7520 9.9544 19.7227 27.5679 30.9556 27.8663 27.7113 28.2155 42.2016 71.8455 44.7936 26.3783 57.8411 58.6532 47.9123 46.6366 32.1095 27.8079 2067.6633 1391.8820 1472.6080 1046.0656 1523.9217 272.5839 180.5958 59.9245 56.8095
temp: 298.150 k
press: 1.00000 atm
elementType: 6 6 8 8 1 1 6 6 8 8 1 1 6 6 8 8 1 1 15 15 15 6 8 8 8 8 8 8 8 8 8 8 1 1 12 8 1 1 8 1 1 8 1 1 1 1 1 1 1 1 1 6 1 6 1 1 1 8 1 6 1 6 1 1 1 8 1 6 1 6 1 1 1 8 1 19
symmnumber: 1
zpe: 1185445.6 jmol-1
zpe.correction: 0.451512 hartree
zpe.thermalcorrener: 0.494167 hartree
zpe.thermalcorrenthalpy: 0.495111 hartree
zpe.thermalcorrgfe: 0.375981 hartree
zpe.sumelectzpe: -3997.716315 hartree
zpe.sumelectthermal: -3997.673660 hartree
zpe.sumelectthermalent: -3997.672716 hartree
zpe.sumelectthermalfe: -3997.791846 hartree
dipole: -2436.3076 -1133.1877 -2318.8516
dipole: 3549.1945
quadrupole: -309372.7045 -67349.3374 -280307.2739
quadrupole: -143599.2048 -293987.7147 -136900.2846
quadrupole: -90362.9325 151660.4345 -61297.5020 -143599.2048 -293987.7147 -136900.2846
hfenergy: -3998.1678269 hartree
pointgroup: C01 [X(C13H36K1Mg1O22P3)]
dipole: 3.1946785 -5.5120848 -9.6220815 debye
polarizability: 460.6888022|-11.7815561|446.9373702|-4.2410311|-6.4402216|474.7312703 unknown
InChI: InChI=1/3C2H3O2.3C2H6O.CH3O7P2.K.Mg.O3P.3H2O/c3*1-2(3)4;3*1-2-3;1-7-10(5,6)8-9(2,3)4;;;1-4(2)3;;;/h3*1H3;3*3H,2H2,1H3;1H3;;;;3*1H2/q;;-1;;;;-3;+2;+4;-2;;;/rC7H22KMgO16P3.2C2H3O2.C2H6O.H2O/c1-5-17-8(18-6-2)20-26(13)22-9(11,12,19-7(3)10)23-27(14,15)25-28(16-4,21-8)24-9;2*1-2(3)4;1-2-3;/h17-18H,5-6,11-12H2,1-4H3;2*1H3;3H,2H2,1H3;1H2
charge -4 multiplicity 1
76 atoms
C  124.90057 62.35901 122.27627
C  124.2401252 63.70875011 122.610476
O  124.57387098 64.69925227 121.8988959
O  123.43194856 63.74315882 123.58099167
H  124.33446476 61.52440393 122.68288646
H  125.89799919 62.32758171 122.71397451
C  129.0310 55.06592 123.79602
C  129.63803229 55.5074125 122.49188986
O  128.87462462 55.88056534 121.57468503
O  130.91016254 55.49964492 122.41857446
H  129.31886743 55.79136072 124.56101667
H  129.47874661 54.11735762 124.09949338
C  130.58049 59.06912 124.72983
C  129.16156946 59.31802582 124.2420618
O  129.04338131 59.41996197 122.97470912
O  128.2398353 59.42631257 125.07194364
H  131.16589264 59.97947781 124.5800071
H  131.05571042 58.28936869 124.13465347
P  129.46369936 57.71735775 116.66406157
P  127.37604313 55.81868343 117.75986569
P  126.38158108 58.28763178 120.16659454
C  130.95206 55.59596 116.2220
O  130.48971594 56.85772381 115.71250354
O  130.03565334 57.77965393 118.06273046
O  128.48200719 55.49431991 118.76859248
O  125.6691538 59.32479378 119.36519749
O  129.19577482 59.00692741 115.9479936
O  126.88548308 54.65127431 116.94721718
O  127.88224138 58.26668893 120.10377401
O  128.12519487 56.83344529 116.61003689
O  126.27865236 56.71413528 118.3543935
O  125.60780596 57.35106792 121.03903768
H  130.15184597 55.07152825 116.74318743
H  131.7733239 55.75297667 116.92092561
Mg 129.38398 56.96817 119.86701
O  131.13328956 55.50691787 119.74701029
H  131.15928606 55.32730446 120.71830058
H  130.50516032 54.88129834 119.36043535
O  126.58857141 59.7553704 122.05576613
H  127.49788833 59.60423667 122.43250709
H  125.98185991 59.34245734 122.67621935
O  130.64356224 58.14259009 121.17532263
H  130.0683961 58.64792047 121.80984395
H  131.03984035 57.43607016 121.71056748
H  131.28405 54.98278 115.41039
H  127.9657 54.96954 123.8245
H  130.6312 58.79809 125.76396
H  125.0128 62.24157 121.21873
H  126.3868 62.42221 113.69414
H  122.79651 55.41464 120.18684
H  123.62188 56.42678 116.05269
C  125.89097 62.29901 114.65699
H  126.62090036 62.55594644 115.42443414
C  124.67898747 63.21081728 114.7609037
H  123.94236977 62.97020072 113.9914236
H  124.20336488 63.11241771 115.73634372
H  124.97687537 64.25192335 114.62577211
O  125.57342687 60.92473459 114.87233106
H  124.86291459 60.65555322 114.28328032
C  122.43899 56.16504 120.89199
H  121.35266171 56.20832432 120.77085317
C  122.77385332 55.72327912 122.31482555
H  122.36737643 56.42872072 123.04154602
H  122.35336877 54.73495654 122.51887421
H  123.8534136 55.67363448 122.45477069
O  122.92321717 57.45513847 120.58034213
H  123.90200547 57.45541813 120.69977512
C  124.4490 57.0950 115.81302
H  125.34281335 56.4727267 115.74513256
C  124.16897089 57.75141989 114.46811374
H  125.02768026 58.33781904 114.1385817
H  123.96467218 56.99392004 113.7084789
H  123.29947082 58.40987858 114.53212842
O  124.61565402 58.08245729 116.81224537
H  125.16299346 57.64723128 117.5134271
K  126.70905 60.00599 117.10197
