program: Gaussian 16
title: TitleCard Required
version: ES64L-G16RevC.02
method: UM11
basis: Gen
operation: Freq
keyword: #P
keyword: Geom=AllCheck
keyword: Guess=TCheck
keyword: SCRF=Check
keyword: GenChk
keyword: UM11/ChkBas
keyword: Freq
title: Title Card Required
converged: YES YES NO YES
polarizability: 6.83050302e+02 1.53577613e+01 6.80615239e+02 -1.71055672e+00 7.44047833e+00 6.22466357e+02
1716.lowfreq: -5.6607 -0.0023 -0.0014 0.0006 0.8107 3.1681 5.6865 11.9297 17.9701
redmass: 6.0459 5.2732 5.6033 5.2425 5.9577 1.2114 4.9853 5.2308 3.4498 5.1015 5.6981 5.0428 5.1192 3.4495 14.1876 4.2995 2.9683 9.5051 4.1349 3.0596 9.0210 4.9646 8.4438 1.5256 3.0673 3.0654 4.5807 2.2343 3.0371 3.0527 2.6241 1.3489 2.9114 3.0322 2.2085 2.2251 1.4124 2.0675 1.7041 2.1378 2.1705 2.0378 2.6153 3.1375 3.9392 2.1364 3.0249 2.1103 2.3584 2.0114 1.7207 2.5242 3.6697 2.3496 3.0170 3.1078 2.9448 3.1301 3.7612 6.9048 6.3730 9.7101 2.3534 1.7795 1.8575 2.7668 3.4620 3.2019 2.6826 3.0570 2.6181 3.0359 2.9842 2.6537 3.4215 3.4094 2.4879 2.5749 3.5455 2.6069 3.4050 4.6433 3.2448 4.7286 3.6475 4.4038 3.7123 3.0442 3.0514 2.6113 3.7710 3.7134 3.0830 5.3840 2.4707 4.4994 1.3635 6.9868 2.8778 3.3888 3.2632 4.1619 3.3347 1.9080 3.6885 2.7101 2.4711 2.3180 1.6655 1.2280 1.8289 1.8267 2.1075 2.1682 1.5068 2.1492 1.8383 1.8361 2.1597 1.1932 1.9356 1.8313 2.1303 1.5482 4.6985 1.6879 1.6136 1.8817 1.7654 1.6926 1.6901 2.0548 1.8326 2.2196 1.5555 1.8884 1.8528 1.9980 1.6902 1.8378 1.9309 2.1319 2.3592 2.1995 2.4186 2.7591 2.2800 2.1172 2.1386 1.9355 2.0455 2.0758 2.2681 2.0453 1.7556 1.7882 2.0352 2.5964 1.8544 1.7871 1.7140 1.8501 1.7178 1.9318 1.8692 2.0884 1.5983 1.4930 1.5482 1.6322 1.9433 1.7665 1.4299 1.5686 1.7838 1.6040 2.3549 1.5879 1.5784 2.1850 1.5265 1.8780 1.6017 1.5848 1.4279 1.6583 1.1702 1.6490 1.9194 1.6376 1.3792 1.5513 1.3204 1.5284 1.4160 1.7489 1.2620 1.7440 1.3602 1.2719 1.2113 1.5473 1.0938 1.1140 1.3121 1.0690 1.0964 1.0799 1.0435 1.0458 1.0999 1.0698 1.0691 1.0659 1.0743 1.0439 1.0569 1.0863 1.0645 1.0622 1.0551 1.0673 1.0759 1.0470 1.0641 1.0599 1.0806 1.0827 1.1001 1.0618 11.1605 5.4691 10.5984 11.8606 11.7965 11.2341 1.0833 1.0832 1.0471 1.0568 1.0731 1.0818 1.0619 1.0391 1.0394 1.0403 1.0368 1.0624 1.0630 1.0534 1.0842 1.0465 1.0369 1.0512 1.0988 1.0579 1.0882 1.0981 1.0924 1.0997 1.1012 1.1029 1.1025 1.1027 1.1000 1.1016 1.1011 1.1037 1.1001 1.1037 1.1013 1.1012 1.1016 1.1020 1.1028 1.0989 1.1009 1.0921 1.0972 1.1063 1.0316 1.0309 1.0940 1.0935 1.0929 1.0915 1.0661 1.0665
irintensity: 0.0486 0.1681 0.9425 1.9043 5.7188 0.6606 0.1086 3.2867 1.8089 2.0447 1.5234 3.8658 13.5740 0.9025 2.0810 3.6711 0.1811 18.3948 3.8097 2.0075 10.8488 3.4040 0.3775 0.0540 2.1651 2.6819 10.9627 0.6451 1.1823 12.6030 0.3579 3.5387 13.2656 6.7010 2.1731 21.0058 1.0349 2.3981 1.2422 11.2108 5.3028 0.3545 18.3981 4.5096 5.3225 6.5392 21.8248 3.1776 0.5675 14.4540 3.0952 5.3615 35.4042 4.8545 7.7201 7.9205 2.8613 1.4020 6.8075 82.8420 43.9879 82.4003 38.2690 56.5004 76.0267 5.5301 3.4287 7.8031 10.5521 1.8507 6.5758 6.5737 8.1912 2.5357 8.5692 6.9046 0.4375 5.1657 13.6992 3.0622 4.2206 28.1051 2.2100 24.5801 14.5735 1.7619 7.8271 15.9737 11.7124 14.3630 7.0064 4.0879 123.9404 57.7375 22.9390 100.5822 204.1947 65.4372 13.1629 5.3838 11.4489 6.1630 4.1684 0.7194 5.9057 2.3399 10.8321 4.0930 15.4585 12.3432 5.7078 5.5693 21.5408 16.1821 20.1358 11.3388 13.7039 3.4451 1.5398 12.0661 15.7447 2.6870 9.9414 1.8343 23.5529 6.1270 5.4654 21.7773 28.1520 30.0444 77.0277 15.3063 19.2016 20.8691 35.9102 27.7200 3.2632 46.0255 15.3087 17.1220 22.1314 13.2265 31.3312 3.0821 33.6042 97.7740 3.5657 45.9138 83.6834 49.4711 8.2613 8.6311 18.4379 4.5615 6.5237 16.1416 23.2191 15.7536 31.6264 17.5305 21.8364 18.3247 20.1606 9.5891 24.6748 18.6083 91.1410 56.6527 16.3649 6.9641 8.8292 58.6560 12.6494 83.6255 408.6670 141.7029 49.4305 100.0997 23.9786 383.5081 3.8767 4.8797 15.4433 11.0499 0.6746 40.1886 217.0113 62.8483 286.7355 140.9007 9.6396 10.8004 26.0308 149.5931 1.2751 96.9484 17.7066 80.0785 14.0963 36.3030 326.4089 18.6639 20.8270 44.8335 15.2490 29.1367 26.5916 16.3094 20.1577 3.1318 3.6737 1.7980 1.5573 15.2249 20.8680 25.6694 13.9593 18.2154 8.9017 11.7225 11.0839 17.4031 11.5401 17.7996 12.9090 43.1477 80.1997 147.1034 108.9936 64.5915 49.7963 62.2168 1119.6966 572.7346 425.1332 305.7326 60.7462 36.6084 35.8270 28.7828 60.7279 39.4892 16.0399 37.2686 19.5176 28.8765 32.2541 43.6237 12.7380 14.9239 29.7414 20.9381 2.5066 43.5502 35.5274 63.7186 4.1198 13.8659 3.2614 55.3557 52.7560 31.1034 47.0717 39.7983 45.9789 28.6027 53.6083 39.5036 53.3913 26.5630 30.2635 40.8224 13.4074 32.3762 2.2517 41.0855 13.7546 13.3346 40.0063 7.9355 175.3348 142.3271 111.8947 115.0221 111.5040 119.5591 533.5007 124.0818
temp: 298.150 k
press: 1.00000 atm
elementType: 6 6 6 8 6 8 6 78 6 7 1 1 1 1 1 7 1 1 1 1 6 1 8 1 6 17 1 17 1 6 1 8 6 8 1 6 1 1 1 1 6 1 1 6 1 1 6 1 1 6 6 6 1 8 1 6 8 6 6 1 1 6 6 1 1 1 6 1 1 1 6 1 6 1 6 1 1 8 1 6 1 6 1 1 1 6 1 1 6 8 6 1 1 1 6 1 1 1
symmnumber: 1
zpe: 2184616.2 jmol-1
zpe.correction: 0.832076 hartree
zpe.thermalcorrener: 0.883571 hartree
zpe.thermalcorrenthalpy: 0.884515 hartree
zpe.thermalcorrgfe: 0.741006 hartree
zpe.sumelectzpe: -3075.106952 hartree
zpe.sumelectthermal: -3075.055457 hartree
zpe.sumelectthermalent: -3075.054513 hartree
zpe.sumelectthermalfe: -3075.198022 hartree
dipole: 16.8373 5.9708 -1.2614
dipole: 17.9092
quadrupole: -416.5202 -289.1996 -339.2675
quadrupole: 107.2755 40.8806 -15.3391
quadrupole: -68.1911 59.1295 9.0616 107.2755 40.8806 -15.3391
hfenergy: -3075.9390283 hartree
pointgroup: C01 [X(C32H52Cl2N2O9Pt1)]
dipole: 6.62432 2.3490981 -0.4962691 debye
polarizability: 683.0503016|15.3577613|680.6152389|-1.7105567|7.4404783|622.4663565 unknown
InChI: InChI=1/C30H43O7.C2H3O2.2ClH.2H3N.Pt/c1-15(10-17(31)11-16(2)26(36)37)18-12-23(35)30(7)25-19(32)13-21-27(3,4)22(34)8-9-28(21,5)24(25)20(33)14-29(18,30)6;1-2(3)4;;;;;/h15-16,18-19,21,23,32,35H,8-14H2,1-7H3;1H3;2*1H;2*1H3;/q2*-1;;;;;+4/p-2/rC32H52Cl2N2O9Pt/c1-16(11-19(38)12-17(2)28(43)45-46(33,34,35,36)44-18(3)37)20-13-25(42)32(8)27-21(39)14-23-29(4,5)24(41)9-10-30(23,6)26(27)22(40)15-31(20,32)7/h16-17,20-21,23,25,39,42H,9-15H2,1-8,35-36H3
charge 0 multiplicity 1
98 atoms
C  -6.15130829 -3.60770304 1.12507312
C  -0.34348964 10.5358135 4.64743043
C  -5.47186752 -2.27014663 1.54891651
O  0.79735607 10.98642183 4.55219528
C  -6.35048589 -1.2245226 2.29612821
O  -1.42458134 11.18724897 4.28495751
C  -7.55986534 -0.93515495 1.37266589
Pt -1.29635757 13.02763698 3.44773844
C  -8.32971322 -2.21119771 0.99960038
N  -0.02348811 13.66731682 4.92669065
H  -8.25725572 -0.24175653 1.85248551
H  -0.16530388 14.66514671 5.11855647
H  -7.19185701 -0.45132837 0.45116337
H  -0.20153366 13.15580401 5.7977385
H  -8.79290043 -2.64739659 1.90054231
N  0.21139946 12.40942007 2.19834921
H  -9.14094684 -1.98652914 0.29478562
H  0.10602458 11.41502195 1.96926267
H  -5.21622798 -1.77767774 0.58896825
H  0.18892767 12.93534583 1.31788645
C  -7.45221232 -3.27631746 0.38822811
H  0.96078149 13.53148162 4.677959
O  -7.78455976 -3.85908337 -0.63384014
H  1.13606063 12.53854529 2.61874472
C  -6.50399027 -4.53712144 2.3079743
Cl -2.77694443 12.30397791 1.78307546
H  -6.80494467 -5.52288 1.92103232
Cl -3.04144454 13.72034267 4.84681686
H  -5.61777147 -4.68181092 2.94500826
C  -0.19712079 15.51962093 2.38517146
H  -7.3202594 -4.16036824 2.93538576
O  0.91852639 15.08215653 2.66819574
C  -5.22472376 -4.38330168 0.17825302
O  -1.31761545 14.86750681 2.59859118
H  -4.36954614 -4.8064508 0.7228212
C  -0.41745916 16.87310914 1.75298693
H  -5.77323708 -5.21409551 -0.28452198
H  0.54489892 17.36470056 1.57598847
H  -4.8418985 -3.73728335 -0.62740211
H  -0.95835518 16.75468827 0.80447528
C  -6.83916635 -1.661515 3.69820751
H  -1.03610224 17.49191094 2.4172429
H  -6.06879043 -2.2177147 4.25105835
C  -0.65245042 9.14532288 5.19243596
H  -7.10100159 -0.77471206 4.28951722
H  -7.73805579 -2.28990355 3.65017996
C  -4.15996602 -2.46970421 2.29918825
H  -3.57345327 -3.30836156 1.90197346
H  -4.33376153 -2.67494263 3.36593005
C  -5.49237753 0.0481356 2.46166113
C  -4.13718334 0.06566832 2.39280758
C  -3.32009461 -1.21010775 2.18513234
H  -2.88977969 -1.15932866 1.1671524
O  -2.25761705 -1.32553969 3.12976752
H  -1.51523666 -0.7891024 2.79913212
C  -6.22127044 1.32825281 2.77611229
O  -7.38359079 1.3178971 3.16811701
C  -3.37846456 1.39042563 2.31471086
C  -5.49993611 2.65696651 2.64880717
H  -6.08217953 3.38806862 3.2210633
H  -5.52086535 2.9660771 1.59121859
C  -4.0657694 2.51401647 3.15121309
C  -3.31292372 1.70990207 0.79609002
H  -2.69814129 2.59524681 0.5850561
H  -2.85043887 0.86808278 0.26298706
H  -4.3141867 1.86132862 0.37195638
C  -4.10606884 2.15348667 4.65409463
H  -4.78064856 2.84315915 5.18404486
H  -4.47651112 1.13086558 4.82210942
H  -3.11935372 2.23396295 5.13188549
C  -1.94241402 1.50396082 2.868432
H  -1.88742964 1.05407749 3.86909228
C  -3.10538695 3.71421137 2.9321147
H  -3.30168548 4.12263252 1.92576469
C  -1.70511312 3.02997983 2.95257219
H  -1.15880381 3.27965801 3.87553002
H  -1.08409203 3.35514616 2.10436205
O  -0.99818906 0.82794008 2.02183926
H  -0.10072147 1.10336453 2.269107
C  -3.19364583 4.89527886 3.9163529
H  -2.92881302 4.53960803 4.92511713
C  -4.58713938 5.53551861 3.96030774
H  -4.95564033 5.73139542 2.93938754
H  -5.32159649 4.8993563 4.47239794
H  -4.55724399 6.49494329 4.49838728
C  -2.16508165 5.95914201 3.51367298
H  -1.17365169 5.51400676 3.31584552
H  -2.46178152 6.45693743 2.57413403
C  -1.9159017 7.02090135 4.5650695
O  -2.21687358 6.8648455 5.73776886
C  -1.26445167 8.29816083 4.06919811
H  -0.50840185 8.04162776 3.30900835
H  -2.05842942 8.85647682 3.54442395
H  -1.41937988 9.27266174 5.97108223
C  0.59265819 8.49041929 5.78330862
H  0.3389161 7.50295348 6.19357363
H  1.36605533 8.36180534 5.01221964
H  1.01775864 9.10111861 6.5919152
