program: Gaussian 16
title: TitleCard Required
version: ES64L-G16RevC.02
method: UM11
basis: Gen
operation: Freq
keyword: #P
keyword: Geom=AllCheck
keyword: Guess=TCheck
keyword: SCRF=Check
keyword: GenChk
keyword: UM11/ChkBas
keyword: Freq
title: Title Card Required
converged: YES YES NO NO
polarizability: 6.65432950e+02 2.10336996e+01 6.68106251e+02 -2.81955077e-01 1.44499308e+01 5.87119984e+02
1716.lowfreq: -2.2980 -0.0015 0.0012 0.0021 2.2401 8.8244 9.7085 14.5477 20.1712
redmass: 6.0399 5.0618 5.5105 7.1941 5.8434 1.7476 2.9439 5.1002 4.5404 3.5135 4.2851 4.6454 3.1807 4.9874 14.0930 4.1499 2.8673 4.4632 14.2279 3.2790 8.8524 4.8513 1.4286 16.0670 2.7003 3.3590 1.6396 2.2310 2.1730 5.3697 3.4900 2.8907 4.0543 1.8158 2.4373 2.2851 1.9383 2.0274 1.5634 1.4228 2.3930 2.4824 2.4184 2.8296 3.2345 1.8869 2.4233 2.8925 1.6067 1.6283 3.5514 2.4760 4.0991 2.3927 2.8327 2.8490 3.1751 1.6487 2.0750 2.7167 5.0381 12.1065 14.4082 2.9411 2.7845 3.2439 3.3226 3.1597 2.6967 3.0442 2.6266 2.9542 3.0212 2.6985 3.1916 3.5006 2.5341 2.5515 3.6059 2.6353 3.4072 4.6884 3.3395 4.7216 3.5399 4.4771 3.6975 3.0322 3.0805 2.5879 2.0236 3.3123 2.2036 2.3432 5.1507 2.7823 4.5707 7.0204 3.3997 3.3764 3.3442 4.1882 3.4129 1.7064 4.8729 2.6833 2.5213 2.3374 2.3709 2.0681 1.1648 2.0435 1.4509 2.3526 2.2281 1.6469 1.4067 1.9411 2.1226 1.9444 1.8503 2.1264 1.8825 1.9728 1.7224 1.4546 1.8447 1.6461 1.7539 1.6839 1.6446 2.1508 1.8346 2.0238 1.5792 1.9850 1.9561 1.8483 1.8404 1.8544 1.9451 2.2060 2.5497 2.9675 2.3772 2.0956 2.3139 2.0563 2.1401 1.8262 2.0895 2.0895 2.4593 1.9004 1.7583 1.6667 2.1419 2.5688 1.8624 1.5983 2.0336 1.7863 1.6420 2.0039 1.6613 2.3556 1.5229 1.5202 1.4420 1.6245 1.7653 1.8939 1.4417 1.7286 1.8298 1.5514 2.3022 1.6004 1.6023 2.2272 1.5170 1.8784 1.5774 1.5570 1.4693 1.6446 1.1728 1.5581 1.8854 1.7110 1.3673 1.6046 1.3166 1.4598 2.1068 1.2638 1.2971 1.8654 1.2704 1.2445 1.6612 1.1663 1.1047 1.1036 1.2507 1.0673 1.0962 1.0843 1.0442 1.0466 1.0964 1.0742 1.0737 1.0674 1.0713 1.0852 1.0435 1.0561 1.0642 1.0750 1.0586 1.0614 1.0601 1.0472 1.0631 1.0602 1.0691 1.1465 1.0546 1.0627 11.1101 5.5127 9.9119 11.8457 11.6293 11.1745 1.0835 1.0832 1.0574 1.0494 1.0802 1.0734 1.0618 1.0391 1.0387 1.0405 1.0376 1.0627 1.0636 1.0524 1.0854 1.0463 1.0367 1.0524 1.0981 1.0569 1.0866 1.0997 1.0957 1.1001 1.0978 1.1032 1.1025 1.1011 1.1014 1.1008 1.1032 1.1011 1.0999 1.1012 1.1036 1.1014 1.1015 1.1015 1.0991 1.1026 1.1005 1.0975 1.0918 1.1067 1.0302 1.0307 1.0943 1.0941 1.0934 1.0916 1.0664 1.0666
irintensity: 0.1570 0.2549 1.6360 1.2073 2.4562 1.7271 0.2301 3.2622 3.0841 0.7790 1.1304 4.8230 2.2506 10.3237 0.4875 3.3689 0.0491 5.7019 16.6124 2.2285 14.0862 3.1662 0.1517 0.1659 2.7592 1.6030 9.7514 5.5026 1.2070 0.6665 15.2175 1.1983 2.0580 2.1684 23.3822 8.2619 5.6837 10.0081 0.7948 10.7503 13.2362 15.1706 4.3070 7.2923 1.6089 5.5477 17.5781 4.2526 4.3241 9.2407 32.5907 10.2999 32.2115 5.6796 4.8094 15.7568 1.0328 94.4707 64.4172 27.0902 21.7001 74.5911 67.3612 1.1475 15.3523 13.5618 3.4217 8.8275 10.3934 0.8938 7.2073 4.8236 7.6902 2.0289 12.2885 4.3692 0.4698 5.5215 15.2669 5.2549 4.4886 30.2066 3.5986 20.4401 15.9696 2.3751 11.4223 26.4371 10.6830 16.0279 66.2805 56.2298 217.8655 11.1950 69.5681 37.0707 73.4836 61.9219 0.3345 8.9461 12.8483 4.7962 2.2648 1.1781 4.8159 2.9617 8.4741 4.2951 6.0285 17.8004 13.6760 16.6442 14.0198 8.1634 13.7956 14.0051 27.7144 8.4579 0.9179 13.5889 3.5396 8.1721 11.3416 6.0375 5.6340 35.4037 21.3049 4.2640 22.2165 28.0597 80.5242 9.5722 14.7170 27.1388 31.0186 34.8159 5.7002 17.5621 43.6267 17.8106 28.4255 20.1788 34.8691 106.2186 26.8604 40.0306 1.2972 36.0999 75.5917 47.5916 7.8241 12.7584 22.7875 0.9777 5.2318 19.6465 17.3212 18.6351 12.7660 18.7943 32.1933 15.9109 20.8327 9.1670 14.4611 43.2944 47.5381 94.2216 6.6534 19.0992 47.4781 59.0950 31.9384 72.9651 478.9278 54.5819 54.9864 34.2493 72.9467 399.0489 4.0947 4.3995 15.3634 12.1124 0.5444 50.5969 177.3215 57.7732 258.7950 203.6964 15.2166 4.3611 25.5300 134.9818 76.9746 31.7322 29.8898 75.7672 17.0017 25.5977 12.2964 215.1615 15.3237 48.4401 9.5171 30.3998 24.2292 16.1531 18.6707 2.5169 3.3006 2.1531 2.4256 15.8460 14.1069 14.5210 22.1395 12.8278 9.1102 13.5698 3.8517 25.1163 6.3840 13.2757 13.3032 40.3543 36.8818 191.7764 68.5657 34.1759 70.3002 40.6251 1293.9552 676.4914 522.1129 342.6328 45.9960 23.6133 24.3377 39.8799 19.4505 46.2940 13.5260 31.3143 17.2927 21.5986 26.6566 42.1133 11.9301 13.7814 18.0737 17.1766 1.4383 32.0880 29.3220 55.2216 4.6744 8.7023 0.8696 42.8261 52.4102 25.3487 38.7910 17.3200 50.0378 23.5281 32.8252 46.9805 41.2963 28.2616 24.5618 39.6516 12.2977 28.3511 41.5572 1.1192 9.6772 22.6147 14.9250 6.2529 170.6728 116.7347 110.1660 117.4880 109.7607 125.5621 504.1523 129.1982
temp: 298.150 k
press: 1.00000 atm
elementType: 6 6 6 8 6 8 6 78 6 7 1 1 1 1 1 7 1 1 1 1 6 1 8 1 6 17 1 17 1 6 1 8 6 8 1 6 1 1 1 1 6 1 1 6 1 1 6 1 1 6 6 6 1 8 1 6 8 6 6 1 1 6 6 1 1 1 6 1 1 1 6 1 6 1 6 1 1 8 1 6 1 6 1 1 1 6 1 1 6 8 6 1 1 1 6 1 1 1
symmnumber: 1
zpe: 2185940.1 jmol-1
zpe.correction: 0.832581 hartree
zpe.thermalcorrener: 0.883924 hartree
zpe.thermalcorrenthalpy: 0.884868 hartree
zpe.thermalcorrgfe: 0.745814 hartree
zpe.sumelectzpe: -3075.112947 hartree
zpe.sumelectthermal: -3075.061603 hartree
zpe.sumelectthermalent: -3075.060659 hartree
zpe.sumelectthermalfe: -3075.199714 hartree
dipole: 16.3055 5.8722 -0.8626
dipole: 17.3521
quadrupole: -416.7087 -290.3660 -336.6040
quadrupole: 95.7113 36.6701 -15.0748
quadrupole: -68.8158 57.5269 11.2889 95.7113 36.6701 -15.0748
hfenergy: -3075.9455271 hartree
pointgroup: C01 [X(C32H52Cl2N2O9Pt1)]
dipole: 6.415073 2.3102895 -0.3393813 debye
polarizability: 665.4329497|21.0336996|668.1062507|-0.2819551|14.4499308|587.1199841 unknown
InChI: InChI=1/C30H43O7.C2H3O2.2ClH.2H3N.Pt/c1-15(10-17(31)11-16(2)26(36)37)18-12-23(35)30(7)25-19(32)13-21-27(3,4)22(34)8-9-28(21,5)24(25)20(33)14-29(18,30)6;1-2(3)4;;;;;/h15-16,18-19,21,23,32,35H,8-14H2,1-7H3;1H3;2*1H;2*1H3;/q2*-1;;;;;+4/p-2/rC32H52Cl2N2O9Pt/c1-16(11-19(38)12-17(2)28(43)45-46(33,34,35,36)44-18(3)37)20-13-25(42)32(8)27-21(39)14-23-29(4,5)24(41)9-10-30(23,6)26(27)22(40)15-31(20,32)7/h16-17,20-21,23,25,39,42H,9-15H2,1-8,35-36H3
charge 0 multiplicity 1
98 atoms
C  -6.11177135 -3.66070443 1.17976755
C  -0.34494647 10.5342738 4.57402611
C  -5.45227772 -2.30621145 1.58144621
O  0.80678461 10.96789895 4.49898687
C  -6.34470787 -1.26649814 2.32190398
O  -1.4037871 11.21178853 4.20213729
C  -7.56323003 -1.0085486 1.40006797
Pt -1.23136962 13.07983453 3.43853631
C  -8.31379137 -2.30195053 1.04726606
N  0.01427742 13.63872495 4.97492363
H  -8.2741712 -0.32321484 1.87135023
H  -0.13787709 14.62438733 5.21554797
H  -7.20879532 -0.53017795 0.47060413
H  -0.17855679 13.07145764 5.80766121
H  -8.76719591 -2.73311562 1.95567804
N  0.30003224 12.49593983 2.19762823
H  -9.13090306 -2.10169777 0.34193284
H  0.19959647 11.50565838 1.94970992
H  -5.21026164 -1.82195965 0.61384695
H  0.28192191 13.04660266 1.3321546
C  -7.42189077 -3.36021646 0.45230933
H  1.00296206 13.5229189 4.73236713
O  -7.75292813 -3.96775693 -0.55970419
H  1.21761178 12.62024023 2.63527515
C  -6.44446625 -4.57893498 2.37743978
Cl -2.68071865 12.4420317 1.71599912
H  -6.75305172 -5.56751186 2.00455371
Cl -3.00149942 13.73852737 4.81728071
H  -5.54690608 -4.71760788 2.9995752
C  -0.07866456 15.60605963 2.51559111
H  -7.24865903 -4.19431874 3.01550762
O  1.02417499 15.14695675 2.8252416
C  -5.18188808 -4.43483465 0.23470846
O  -1.20608999 14.95064706 2.66113873
H  -4.30323206 -4.816476 0.7719894
C  -0.26671928 16.98421467 1.93318779
H  -5.71049506 -5.29736664 -0.19172194
H  0.70510589 17.46985176 1.79572573
H  -4.83648692 -3.80182947 -0.59763104
H  -0.79219223 16.90910039 0.97180402
C  -6.81634773 -1.696471 3.73288902
H  -0.89212895 17.58194689 2.61042728
H  -6.0468174 -2.26642687 4.2721734
C  -0.68261325 9.14681823 5.10753701
H  -7.05257948 -0.8096468 4.33476273
H  -7.72684195 -2.30917313 3.69963201
C  -4.13321332 -2.47411466 2.32678037
H  -3.53369593 -3.30806081 1.93944658
H  -4.2973957 -2.66547268 3.39771121
C  -5.50580141 0.02154001 2.46593237
C  -4.15155468 0.0623767 2.38496999
C  -3.31616721 -1.20217252 2.18879272
H  -2.88448705 -1.15751863 1.17181734
O  -2.24719113 -1.28591122 3.13341323
H  -1.50184619 -0.76344151 2.78483005
C  -6.24849367 1.29077643 2.77665106
O  -7.41361134 1.26407761 3.1681286
C  -3.41703855 1.39856324 2.28395864
C  -5.55313462 2.63188597 2.64952266
H  -6.14093459 3.34817756 3.23507957
H  -5.60093951 2.94719665 1.59452991
C  -4.10824179 2.51467818 3.12675367
C  -3.38714378 1.7079214 0.76157982
H  -2.78291566 2.59569139 0.53024413
H  -2.93338153 0.86508524 0.2218902
H  -4.39802374 1.85001167 0.35753931
C  -4.11630528 2.15957911 4.63127069
H  -4.79045119 2.84077287 5.17214184
H  -4.46891797 1.13249804 4.80942693
H  -3.12257453 2.25499892 5.09130464
C  -1.9726836 1.53869723 2.80907423
H  -1.88977439 1.09566268 3.81050186
C  -3.17280794 3.72995961 2.88323018
H  -3.39580345 4.12996393 1.87879094
C  -1.76094629 3.0696219 2.87994741
H  -1.20089873 3.33500184 3.79044054
H  -1.16055086 3.39571102 2.01756584
O  -1.03616896 0.87456865 1.9480453
H  -0.1341776 1.07660029 2.24351438
C  -3.26258976 4.9131573 3.86522011
H  -2.9717909 4.56277127 4.86885372
C  -4.66504934 5.53070649 3.93809519
H  -5.0577582 5.7231753 2.9255907
H  -5.37797482 4.88154845 4.46359907
H  -4.64307697 6.48901704 4.47877712
C  -2.25922452 5.99227975 3.43868694
H  -1.26771994 5.56123396 3.2112959
H  -2.586884 6.49181965 2.51031394
C  -1.99086778 7.05094546 4.48543355
O  -2.27314407 6.88972956 5.66453945
C  -1.34494876 8.32912836 3.99044491
H  -0.62144889 8.08059665 3.1968113
H  -2.15393753 8.90475113 3.50886569
H  -1.42875456 9.29235553 5.90364147
C  0.55674963 8.45245568 5.66602783
H  0.28527256 7.4731134 6.08399435
H  1.30733869 8.29981123 4.87635229
H  1.0203185 9.0484009 6.46431227
