program: Gaussian 16
title: Title Card Required
version: ES64L-G16RevC.02
method: UM11
basis: Gen
operation: Freq
keyword: #P
keyword: Geom=AllCheck
keyword: Guess=TCheck
keyword: SCRF=Check
keyword: GenChk
keyword: UM11/ChkBas
keyword: Freq
converged: YES YES NO NO
polarizability: 6.65626872e+02 2.45917945e+01 6.68970167e+02 -3.12024543e+00 1.50203718e+01 5.87269513e+02
1716.lowfreq: -3.3037 -0.0025 -0.0021 -0.0012 2.7139 4.5903 7.0132 14.2282 20.1459
redmass: 5.7763 4.7920 1.4621 4.2300 3.7402 5.0509 5.2297 5.4782 4.5264 3.9692 5.3272 5.4205 4.6143 4.1367 9.4946 5.7602 5.1822 3.1602 12.4774 4.1143 4.3695 4.7383 12.9064 1.4144 3.5342 3.0480 3.0445 2.1600 5.5217 3.6076 1.4869 3.3511 2.6439 2.5636 2.8826 2.4188 1.9125 2.7847 1.6980 1.6699 1.7408 2.0218 2.4701 2.7183 2.1366 2.7133 2.9851 3.0704 1.5402 1.8655 1.7735 4.1705 2.6567 3.7825 2.4936 2.6258 2.6664 3.2163 2.5350 2.5094 27.6549 1.2333 30.8694 2.4968 2.5130 2.7511 3.8419 2.8129 3.3658 2.6353 2.8779 2.9957 2.6340 3.5359 3.1905 3.2279 2.5405 2.7194 3.6311 2.7134 3.4320 4.4658 3.4589 4.7195 3.7360 4.4593 4.8738 3.7164 3.0468 2.9644 1.5966 2.5857 2.2170 2.4516 4.4074 2.8327 6.3314 6.1040 3.5119 3.3662 3.3402 4.2094 3.4084 1.9032 3.6688 2.6471 2.5460 2.3411 2.3743 1.2204 2.4080 2.2472 2.2264 1.6856 1.6586 1.6671 2.0262 1.3134 1.9567 1.9444 1.1724 1.8592 2.1071 1.5377 4.4772 1.7132 1.8448 1.6359 1.7705 1.6832 1.6435 2.1432 1.8268 1.5745 2.0283 1.9631 1.9500 1.9664 1.7525 1.8555 1.9432 2.2292 2.3985 2.2732 3.1708 2.1720 2.3024 2.0650 2.1183 1.8660 2.0368 2.1229 2.4374 1.8951 1.7496 1.6444 2.1706 2.5426 1.9028 1.6861 1.8264 1.7765 1.6535 2.1104 1.8511 1.9647 1.4416 1.4915 1.4506 1.5863 1.7384 1.8523 1.4145 1.6966 1.5270 2.1508 2.0073 1.6777 1.7211 1.8654 1.5143 1.8924 1.5626 1.5454 1.4935 1.6438 3.5493 1.1781 1.5228 1.5777 1.4032 1.5795 1.3225 1.7628 1.7998 1.2448 1.3075 1.5312 1.2992 1.2375 1.1919 1.6203 1.0927 1.1016 1.2356 1.0682 1.0983 1.0438 1.0839 1.0468 1.0928 1.0774 1.0763 1.0710 1.0617 1.0843 1.0507 1.0556 1.0655 1.0767 1.0573 1.0560 1.0625 1.0491 1.0637 1.0597 1.1950 1.0536 1.0538 1.0907 11.1104 4.8426 8.3604 11.8495 11.6271 11.1679 1.0836 1.0832 1.0560 1.0792 1.0519 1.0735 1.0621 1.0392 1.0386 1.0407 1.0372 1.0627 1.0632 1.0514 1.0860 1.0460 1.0366 1.0532 1.0899 1.0935 1.0573 1.1003 1.0966 1.1003 1.0971 1.1032 1.1025 1.1011 1.1015 1.1003 1.1038 1.1007 1.0999 1.1012 1.1040 1.1014 1.1015 1.1015 1.0989 1.1027 1.1006 1.0974 1.0917 1.1067 1.0307 1.0298 1.0943 1.0942 1.0924 1.0929 1.0667 1.0666
irintensity: 1.5945 0.0530 0.8450 3.4854 0.7389 1.0667 1.9048 1.6462 2.7837 1.5926 2.1648 6.4506 8.5121 0.5777 1.7738 5.4704 4.8526 0.8286 10.5823 5.3969 5.6550 8.0877 0.7219 0.3256 1.8024 3.5859 0.6964 3.3761 5.5130 16.8088 1.6891 1.3883 20.1200 3.5470 15.0092 10.8374 6.8846 21.7819 1.0415 0.8050 0.2188 8.0915 3.1300 2.6157 19.3966 4.3096 25.5997 13.4511 4.1246 3.0631 11.8098 34.7146 12.9892 7.3605 2.5224 10.4808 1.1501 1.1947 8.1175 26.0504 84.8114 147.6656 68.9034 16.4180 2.1737 11.7392 11.4347 20.3045 0.3973 5.5586 7.3895 11.9100 3.7786 5.4156 16.7355 15.3765 2.9331 15.9514 15.4216 1.5852 5.7975 22.3819 3.8997 25.0730 19.6027 0.6741 8.2445 8.7317 27.1647 11.3453 136.9377 12.3413 198.2304 4.8308 21.4624 28.8227 179.0702 2.1158 1.0404 8.7117 12.3901 4.9685 2.4079 1.2490 3.5490 3.3242 7.6985 4.3781 4.3346 14.8947 13.9058 20.1604 8.0693 10.4709 12.4990 12.3561 4.5338 32.6010 1.1473 13.9446 22.5278 3.9409 6.6759 2.3234 30.6631 3.9192 22.9169 4.0582 17.9385 31.1255 82.9068 9.4938 15.3126 53.8450 9.2755 28.6010 8.0769 59.9585 28.1000 17.5821 28.6197 31.2519 29.2769 25.3363 115.7531 36.3293 2.1165 30.0101 71.4274 60.0688 8.8652 18.3497 20.5116 1.0449 5.2019 19.0533 16.2079 20.5994 11.2760 26.0988 24.4929 13.0818 20.4859 8.4040 46.5957 12.9087 6.8815 19.3778 16.1660 41.8764 46.9688 9.0488 1.7506 91.5095 14.4142 184.6832 253.7782 68.8158 346.1388 170.9147 4.2998 2.7562 12.7925 18.5386 1.7425 54.6642 570.8052 169.9043 12.6582 3.3485 10.0483 7.0091 22.2531 233.4011 84.0576 22.0557 36.4451 52.6376 54.9790 3.7033 255.3815 10.6599 7.5327 46.1369 9.0425 30.3392 22.8177 18.4732 16.0554 2.6813 4.1172 3.0386 2.5382 12.6182 19.9041 14.7453 38.3497 13.0458 7.0886 16.0271 20.3813 1.9984 13.1704 11.4078 16.7591 40.0815 225.0245 1.5016 76.9412 10.1011 71.0836 182.3191 1133.2549 681.2041 521.8633 350.1467 46.2054 23.7978 24.2507 49.6012 13.5211 46.3190 14.2909 31.0429 17.2901 21.3054 20.8583 41.5661 12.1422 15.2750 13.4511 18.7818 1.4641 31.5235 22.7779 14.4930 53.9811 8.4982 0.9723 46.6799 51.1329 25.2321 41.2614 17.3794 50.6331 29.0752 29.3998 36.8419 40.6172 26.9794 31.7230 39.4246 13.1561 27.6669 44.0351 1.0925 9.5113 24.0018 14.2871 6.6982 152.1448 133.8874 110.4538 114.5732 90.7486 144.2488 504.8025 128.7010
temp: 298.150 k
press: 1.00000 atm
elementType: 6 6 6 8 6 8 6 78 6 7 1 1 1 1 1 7 1 1 1 1 6 1 8 1 6 17 1 17 1 6 1 8 6 8 1 6 1 1 1 1 6 1 1 6 1 1 6 1 1 6 6 6 1 8 1 6 8 6 6 1 1 6 6 1 1 1 6 1 1 1 6 1 6 1 6 1 1 8 1 6 1 6 1 1 1 6 1 1 6 8 6 1 1 1 6 1 1 1
symmnumber: 1
zpe: 2186864.4 jmol-1
zpe.correction: 0.832933 hartree
zpe.thermalcorrener: 0.884123 hartree
zpe.thermalcorrenthalpy: 0.885068 hartree
zpe.thermalcorrgfe: 0.745633 hartree
zpe.sumelectzpe: -3075.111990 hartree
zpe.sumelectthermal: -3075.060800 hartree
zpe.sumelectthermalent: -3075.059855 hartree
zpe.sumelectthermalfe: -3075.199290 hartree
dipole: -0.6516 7.4333 -2.6849
dipole: 7.9302
quadrupole: -406.2386 -252.4567 -349.2979
quadrupole: -119.0033 -23.3917 -31.6335
quadrupole: -70.2409 83.5410 -13.3001 -119.0033 -23.3917 -31.6335
hfenergy: -3075.9449229 hartree
pointgroup: C01 [X(C32H52Cl2N2O9Pt1)]
dipole: -0.2563752 2.9244932 -1.0563035 debye
polarizability: 665.626872|24.5917945|668.9701671|-3.1202454|15.0203718|587.2695134 unknown
InChI: InChI=1/C30H43O7.C2H3O2.2ClH.2H3N.Pt/c1-15(10-17(31)11-16(2)26(36)37)18-12-23(35)30(7)25-19(32)13-21-27(3,4)22(34)8-9-28(21,5)24(25)20(33)14-29(18,30)6;1-2(3)4;;;;;/h15-16,18-19,21,23,32,35H,8-14H2,1-7H3;1H3;2*1H;2*1H3;/q2*-1;;;;;+4/p-2/rC32H52Cl2N2O9Pt/c1-16(11-19(38)12-17(2)28(43)45-46(33,34,35,36)44-18(3)37)20-13-25(42)32(8)27-21(39)14-23-29(4,5)24(41)9-10-30(23,6)26(27)22(40)15-31(20,32)7/h16-17,20-21,23,25,39,42H,9-15H2,1-8,35-36H3
charge 0 multiplicity 1
98 atoms
C  -6.08726208 -3.78447495 1.19721456
C  -0.82075524 10.61272391 4.4706242
C  -5.44088974 -2.42180233 1.59327521
O  0.39135934 11.08825717 4.36225048
C  -6.33719307 -1.39710051 2.34982151
O  -1.83680283 11.24784361 4.16761296
C  -7.57106877 -1.15249581 1.44481704
Pt 0.70985886 12.97398418 3.68824032
C  -8.30820985 -2.45481277 1.09622494
N  -0.59873836 12.70474268 2.1269589
H  -8.28535625 -0.47885495 1.9277338
H  -0.31437891 13.27671701 1.3245546
H  -7.23507041 -0.66581394 0.51280225
H  -0.60202856 11.72117724 1.83606885
H  -8.74430663 -2.89537504 2.00852196
N  -0.71804976 13.71077441 4.9675373
H  -9.13658866 -2.26279374 0.40182497
H  -0.78131583 13.1200389 5.80415965
H  -5.22036494 -1.93164989 0.62347497
H  -0.47380168 14.66149881 5.26556332
C  -7.40861943 -3.4972548 0.48495903
H  -1.55687174 12.96288855 2.3809816
O  -7.7412017 -4.10076915 -0.5289267
H  -1.64380624 13.74370756 4.53001919
C  -6.39492904 -4.70865848 2.39698166
Cl 2.22765606 13.27321978 5.44073468
H  -6.69126021 -5.70163812 2.0258936
Cl 2.35666932 12.13029684 2.25729634
H  -5.48987992 -4.83364494 3.01110725
C  0.23609944 15.68447631 2.69947442
H  -7.1994357 -4.33727773 3.04238807
O  -0.96897504 15.4229184 2.74456364
C  -5.15850988 -4.54529045 0.24039909
O  1.17676943 14.83448916 3.03993625
H  -4.27039709 -4.91887625 0.76769632
C  0.77802832 17.01532653 2.24278767
H  -5.68167277 -5.41241369 -0.18350798
H  -0.04716063 17.69400489 2.0028864
H  -4.82839908 -3.90599071 -0.59334714
H  1.40616142 17.4474214 3.03328483
C  -6.78359275 -1.8393668 3.76527588
H  1.410479 16.86535615 1.35705978
H  -6.00116115 -2.40613539 4.28914267
C  -0.91099211 9.18653135 5.00365125
H  -7.01827558 -0.95847995 4.37643667
H  -7.68928734 -2.45964262 3.7420101
C  -4.10822742 -2.5718633 2.31799885
H  -3.50284047 -3.39670179 1.9204948
H  -4.25281694 -2.76609628 3.39129097
C  -5.51465121 -0.0979 2.48748787
C  -4.16265654 -0.03666592 2.38359909
C  -3.31249499 -1.28790805 2.16741953
H  -2.90198434 -1.23440605 1.14212159
O  -2.22382924 -1.35727442 3.09023929
H  -1.49270591 -0.82511265 2.72659018
C  -6.27049331 1.15819915 2.8176925
O  -7.43079531 1.11273668 3.22196226
C  -3.45030493 1.31085827 2.27526539
C  -5.59599911 2.5103332 2.69411151
H  -6.18264034 3.21052219 3.30006494
H  -5.67047171 2.83775818 1.64428463
C  -4.14000433 2.41094969 3.13988315
C  -3.45854165 1.62853066 0.75433776
H  -2.87229052 2.52605999 0.51450951
H  -3.00455935 0.7949548 0.20053842
H  -4.48013401 1.75766299 0.37344175
C  -4.10924622 2.04580656 4.64168443
H  -4.78169432 2.71219996 5.20264488
H  -4.44143369 1.011965 4.82026331
H  -3.1069709 2.15384956 5.07988426
C  -1.99695621 1.47088797 2.76910892
H  -1.88491904 1.0250905 3.76640392
C  -3.22912627 3.64189172 2.88309113
H  -3.48233434 4.04431526 1.88670728
C  -1.80741391 3.00467116 2.84235784
H  -1.22975831 3.27514021 3.74020033
H  -1.23342015 3.34417721 1.96733023
O  -1.06996165 0.82515099 1.88447603
H  -0.16490856 1.0422993 2.15911024
C  -3.31309423 4.81807966 3.87387079
H  -2.98348887 4.46994563 4.86614677
C  -4.72455813 5.40711381 3.99341791
H  -5.14903109 5.60481775 2.99477664
H  -5.41022968 4.73795979 4.52974365
H  -4.70617595 6.35849915 4.54677796
C  -2.34680795 5.91972163 3.41821744
H  -1.34932413 5.51174359 3.1741031
H  -2.70815745 6.40135563 2.493246
C  -2.08415845 6.99228592 4.45223821
O  -2.276385 6.80721088 5.64593088
C  -1.56769283 8.31534822 3.9253751
H  -0.87301398 8.12241211 3.09156708
H  -2.44612148 8.82441865 3.49186553
H  -1.60697572 9.24278589 5.85518727
C  0.42677994 8.60989216 5.4621188
H  0.27603101 7.60360428 5.8781672
H  1.13245452 8.53766293 4.6218017
H  0.88715316 9.23559672 6.23883274
