program: Gaussian 16
title: TitleCard Required
version: ES64L-G16RevC.02
method: UM11
basis: Gen
operation: Freq
keyword: #P
keyword: Geom=AllCheck
keyword: Guess=TCheck
keyword: SCRF=Check
keyword: GenChk
keyword: UM11/ChkBas
keyword: Freq
title: Title Card Required
converged: YES YES NO YES
polarizability: 6.77276650e+02 2.25783885e+01 6.85742161e+02 -1.46699634e-01 1.41418507e+01 5.97747113e+02
1716.lowfreq: -2.1491 -0.0017 0.0006 0.0013 2.0400 8.2175 10.2165 14.6421 20.9235
redmass: 6.2253 5.0975 6.1478 6.6050 6.5313 5.0385 5.2955 2.4673 4.0755 4.3428 2.5371 4.0698 5.2981 2.5921 11.9521 3.0917 2.8865 4.5760 14.4215 3.2584 8.9405 4.8716 1.4930 13.9143 2.5593 3.5275 6.1055 2.0643 5.3637 2.4296 1.5081 3.2779 6.4258 2.1441 2.5920 2.4610 2.0074 1.9920 1.4147 2.2898 1.5664 1.8548 2.3935 2.5309 3.1925 1.8936 1.9615 2.4707 1.5122 1.9207 3.6248 2.6863 4.0060 2.6370 2.4274 2.9297 2.9972 3.2261 3.3025 5.2987 12.9713 16.4579 2.8733 2.6773 2.3695 1.2982 3.2293 3.0835 2.6277 3.0306 2.5488 2.9861 2.9790 2.6594 3.1148 3.4719 2.5230 2.5500 3.5812 2.6277 3.4043 4.7520 4.8655 3.3612 3.4787 4.4161 3.6667 3.0127 3.0570 2.4960 2.5981 3.1792 2.1455 2.0401 5.0663 2.5797 4.4142 6.7794 3.1702 3.5220 3.2777 3.8846 1.7446 3.3398 4.6873 2.6083 2.6745 2.3390 2.3804 2.1931 2.1672 1.1675 1.3461 2.3126 2.2496 1.7187 1.9729 1.3996 2.0720 1.9719 1.8514 2.1133 1.5391 4.0485 1.7485 1.8709 1.5988 1.2114 1.7760 1.6891 1.6541 2.1635 1.8869 1.7234 2.0528 1.8859 1.8931 1.9073 1.7892 1.9033 2.0580 2.5603 2.4424 3.1620 2.0701 2.0725 2.3270 2.0743 2.1017 1.8526 2.1150 2.1132 2.5159 1.9499 1.8067 1.7282 2.0769 2.5709 1.8621 1.7145 1.8057 1.8779 1.6658 2.0350 1.9440 1.9412 1.5786 1.5068 1.4755 1.6527 1.7686 1.9087 1.7263 1.5449 1.6919 1.5197 2.3812 1.9280 1.7309 1.6134 1.4963 1.8362 1.5592 1.5936 1.3286 1.1700 1.6430 1.9313 1.4532 1.4345 1.4471 1.6416 1.3647 1.6539 1.5407 1.3018 1.3023 1.7809 1.2779 1.2980 1.1404 1.1489 1.1172 1.6804 1.1893 1.0656 1.1143 1.0449 1.0829 1.0469 1.0975 1.0731 1.0862 1.0722 1.0658 1.0478 1.0923 1.0584 1.0695 1.0661 1.0725 1.0625 1.0643 1.0494 1.0684 1.0621 1.0558 1.1333 1.0539 1.0565 11.1502 6.2918 10.4123 11.8557 11.6683 11.2075 1.0833 1.0828 1.0472 1.0571 1.0826 1.0733 1.0390 1.0611 1.0401 1.0383 1.0374 1.0623 1.0608 1.0507 1.0870 1.0481 1.0359 1.0548 1.0940 1.0561 1.0881 1.0975 1.0977 1.0990 1.0964 1.1029 1.1020 1.1026 1.0998 1.1025 1.1000 1.1003 1.0999 1.1033 1.1007 1.1012 1.1010 1.1010 1.1020 1.1013 1.0976 1.0966 1.0914 1.1067 1.0290 1.0298 1.0943 1.0941 1.0933 1.0912 1.0665 1.0668
irintensity: 0.0788 0.2130 1.1919 1.2484 2.8362 0.1897 3.4171 1.9170 1.8359 0.4926 1.8896 4.6412 14.0199 0.2553 0.7534 1.8220 0.0767 5.0398 16.1762 2.1252 14.8808 3.0220 0.2573 0.1901 2.9058 2.5322 13.5968 1.4311 0.8690 12.5730 2.5231 0.1269 1.3260 2.9168 17.4336 13.2041 6.7539 5.7361 4.3522 38.5319 1.1779 2.5132 1.0484 7.5842 1.8321 5.0622 8.1840 6.3432 3.9103 3.0056 30.1969 3.5778 33.1119 0.9733 10.4079 4.4860 1.8734 1.0739 3.6708 29.2750 74.4212 71.6188 2.0808 15.6112 57.3730 109.1112 4.0820 13.0277 22.9847 0.4208 6.2873 7.6986 11.6792 1.8822 10.9394 6.4088 1.1449 5.1014 15.7227 6.4754 4.3672 33.8744 26.9996 4.8683 12.4055 2.0615 9.8833 23.8817 12.3034 13.6970 24.3717 46.5407 243.7756 19.6289 62.6826 53.8542 69.2184 59.6214 1.8015 7.2196 12.9529 4.9330 1.5731 2.1674 4.6427 4.1368 8.0315 5.6660 3.4303 18.8337 24.1821 11.2708 15.4776 10.4299 11.5649 14.9148 2.5150 33.6776 1.5297 14.8382 3.8810 10.1388 2.4936 22.5174 3.2670 26.2996 4.5237 34.1123 24.0735 32.2544 95.8155 10.2171 16.3781 72.0828 5.1221 30.4925 5.2700 28.3797 36.2699 19.8237 30.8734 32.1377 35.8288 124.9807 2.9775 27.9745 2.1918 46.4740 68.9519 41.5888 6.8352 16.4398 25.6385 4.0092 4.4655 21.9919 18.8431 18.2022 20.8950 15.4650 39.2168 18.2463 17.3606 17.1850 35.0869 16.3874 95.8201 109.4286 6.1379 24.9344 39.2833 227.8224 271.5443 191.7462 97.8641 19.2206 65.0026 341.5190 77.7391 25.2728 6.6616 6.7803 20.5521 13.7756 1.0433 165.2960 63.1145 445.9364 3.9380 16.6593 31.7600 180.0491 18.4065 39.0724 3.7010 8.8007 37.5826 95.7980 11.0080 22.3089 6.1298 185.5202 68.1702 16.1674 11.4750 30.9707 26.0809 19.9323 13.9045 2.8682 4.6141 1.4153 3.2339 16.9070 14.1529 26.2355 15.5421 14.7339 9.3639 12.4012 34.9421 2.8151 6.7512 11.4711 15.6481 46.2223 9.1863 223.8354 65.2038 45.2561 74.0735 32.2076 1275.0800 688.1402 551.1311 357.8113 42.1836 21.6590 29.3999 23.9191 23.7793 46.7092 27.5871 14.0587 21.1915 13.1064 24.8115 39.9518 7.2668 12.4391 11.8390 15.6773 1.2462 18.9327 41.5236 52.1618 5.2737 8.1135 1.6014 39.8378 47.9410 24.0252 42.0004 33.3450 34.3449 30.8598 23.3763 42.9424 36.0359 22.7741 26.2027 45.0761 12.4648 21.5937 1.5706 42.8819 6.3159 20.8918 15.3092 6.2474 175.5929 116.0478 113.1520 118.5604 110.7576 127.3619 540.2779 135.4752
temp: 298.150 k
press: 1.00000 atm
elementType: 6 6 6 8 6 8 6 78 6 7 1 1 1 1 1 7 1 1 1 1 6 1 8 1 6 17 1 17 1 6 1 8 6 8 1 6 1 1 1 1 6 1 1 6 1 1 6 1 1 6 6 6 1 8 1 6 8 6 6 1 1 6 6 1 1 1 6 1 1 1 6 1 6 1 6 1 1 8 1 6 1 6 1 1 1 6 1 1 6 8 6 1 1 1 6 1 1 1
symmnumber: 1
zpe: 2169856.6 jmol-1
zpe.correction: 0.826455 hartree
zpe.thermalcorrener: 0.877577 hartree
zpe.thermalcorrenthalpy: 0.878522 hartree
zpe.thermalcorrgfe: 0.740542 hartree
zpe.sumelectzpe: -3075.801402 hartree
zpe.sumelectthermal: -3075.750279 hartree
zpe.sumelectthermalent: -3075.749335 hartree
zpe.sumelectthermalfe: -3075.887315 hartree
dipole: 16.2454 5.9282 -0.9183
dipole: 17.3176
quadrupole: -414.7803 -290.2638 -335.8995
quadrupole: 97.9463 37.0570 -14.1453
quadrupole: -67.7991 56.7175 11.0817 97.9463 37.0570 -14.1453
hfenergy: -3076.6278568 hartree
pointgroup: C01 [X(C32H52Cl2N2O9Pt1)]
dipole: 6.3914439 2.3323257 -0.3612838 debye
polarizability: 677.2766497|22.5783885|685.7421608|-0.1466996|14.1418507|597.7471131 unknown
InChI: InChI=1/C30H43O7.C2H3O2.2ClH.2H3N.Pt/c1-15(10-17(31)11-16(2)26(36)37)18-12-23(35)30(7)25-19(32)13-21-27(3,4)22(34)8-9-28(21,5)24(25)20(33)14-29(18,30)6;1-2(3)4;;;;;/h15-16,18-19,21,23,32,35H,8-14H2,1-7H3;1H3;2*1H;2*1H3;/q2*-1;;;;;+4/p-2/rC32H52Cl2N2O9Pt/c1-16(11-19(38)12-17(2)28(43)45-46(33,34,35,36)44-18(3)37)20-13-25(42)32(8)27-21(39)14-23-29(4,5)24(41)9-10-30(23,6)26(27)22(40)15-31(20,32)7/h16-17,20-21,23,25,39,42H,9-15H2,1-8,35-36H3
charge 0 multiplicity 1
98 atoms
C  -6.10848047 -3.65272532 1.18529856
C  -0.34854802 10.52091322 4.58188815
C  -5.44660536 -2.29906919 1.57917797
O  0.7980397 10.948959 4.51017266
C  -6.33472975 -1.2623657 2.32521019
O  -1.40502335 11.1973839 4.21078105
C  -7.55842786 -1.00575034 1.41274093
Pt -1.231666 13.06921257 3.44232395
C  -8.30929059 -2.29946042 1.06787523
N  0.01977273 13.6286027 4.98032274
H  -8.26221122 -0.32111957 1.88889465
H  -0.13204767 14.61310768 5.21069683
H  -7.21007442 -0.53060028 0.48244838
H  -0.1814403 13.06401426 5.80859713
H  -8.74868842 -2.73293821 1.97858122
N  0.30530301 12.4804591 2.20268469
H  -9.13245993 -2.10297501 0.37295664
H  0.20187231 11.49162191 1.96526329
H  -5.21185508 -1.8162047 0.61191461
H  0.27908826 13.02818418 1.33972101
C  -7.42179484 -3.35385369 0.46323122
H  1.00307913 13.50476944 4.73401543
O  -7.75255204 -3.95448979 -0.54383943
H  1.21654945 12.61218792 2.64325961
C  -6.43494578 -4.56417915 2.38782834
Cl -2.68204397 12.42970432 1.72021053
H  -6.74246517 -5.55247819 2.02114711
Cl -3.00287109 13.7332552 4.81821015
H  -5.53604765 -4.69803463 3.00431004
C  -0.07104589 15.59478648 2.51387792
H  -7.23439103 -4.17761121 3.02542798
O  1.02441065 15.13779305 2.82522961
C  -5.18476372 -4.42909567 0.23853539
O  -1.19844884 14.94397136 2.6587498
H  -4.30552606 -4.80717708 0.77158134
C  -0.25910262 16.96841685 1.92730337
H  -5.71557522 -5.29103671 -0.17929984
H  0.70956537 17.45488327 1.79330973
H  -4.84704983 -3.80021544 -0.59635611
H  -0.77985461 16.88528827 0.96720446
C  -6.79525823 -1.69376883 3.73828074
H  -0.8894126 17.56156595 2.59944981
H  -6.03020781 -2.27729416 4.2630865
C  -0.69255406 9.13518432 5.11123166
H  -7.01094886 -0.80938119 4.34618936
H  -7.71335766 -2.29015363 3.71141748
C  -4.12564957 -2.46601567 2.31708308
H  -3.5268184 -3.29435013 1.92460859
H  -4.28517932 -2.66050552 3.38529391
C  -5.4985585 0.02691458 2.4634935
C  -4.14961739 0.06873511 2.38151138
C  -3.31324594 -1.1926509 2.18188542
H  -2.88539692 -1.14189508 1.16621901
O  -2.24171175 -1.2768701 3.12453351
H  -1.50341968 -0.75288064 2.77739437
C  -6.24603039 1.29346031 2.77799011
O  -7.3989837 1.26184236 3.1811369
C  -3.41704888 1.40446832 2.27872633
C  -5.55375227 2.63363554 2.63727477
H  -6.14155494 3.35310808 3.21340611
H  -5.59921829 2.93318518 1.58066378
C  -4.11135652 2.5201572 3.11759488
C  -3.38380786 1.71325231 0.7580067
H  -2.78149514 2.59981233 0.53044417
H  -2.92603075 0.87339188 0.22298662
H  -4.39144098 1.85129859 0.35258
C  -4.12027661 2.16773311 4.62140038
H  -4.78687503 2.85410217 5.15941582
H  -4.48034701 1.14634059 4.7995019
H  -3.12755117 2.2571454 5.07790888
C  -1.97461161 1.54642619 2.80623573
H  -1.89421588 1.10449631 3.80515801
C  -3.17740368 3.7348326 2.87444733
H  -3.39808245 4.1331698 1.87200482
C  -1.76535341 3.07643143 2.87601665
H  -1.21138312 3.342634 3.78645339
H  -1.16523293 3.40137391 2.0166252
O  -1.03448175 0.88237134 1.94724778
H  -0.13975104 1.12582147 2.21351372
C  -3.27074401 4.91432417 3.85733053
H  -2.98074929 4.56320938 4.85793603
C  -4.67395632 5.52671438 3.92878767
H  -5.06247709 5.71945885 2.91759806
H  -5.38395739 4.87573923 4.44974674
H  -4.65512186 6.48138621 4.47016512
C  -2.27150003 5.99585433 3.43458521
H  -1.28002719 5.57139281 3.20719703
H  -2.5996472 6.49807636 2.51079681
C  -2.00606603 7.04878693 4.4851768
O  -2.2942301 6.8887595 5.65527475
C  -1.35192655 8.32178122 3.99232462
H  -0.62824463 8.06884088 3.20368647
H  -2.15614444 8.89742411 3.50884678
H  -1.44039787 9.28425899 5.90135064
C  0.54044668 8.43585293 5.67305962
H  0.26427357 7.45965152 6.08796805
H  1.29025699 8.28217249 4.88650437
H  1.00301099 9.02822676 6.4706999
