program: Gaussian 16
title: Title Card Required
version: ES64L-G16RevC.02
method: UM11
basis: Gen
operation: Freq
keyword: #P
keyword: Geom=AllCheck
keyword: Guess=TCheck
keyword: SCRF=Check
keyword: GenChk
keyword: UM11/ChkBas
keyword: Freq
converged: YES YES NO YES
polarizability: 2.50501904e+02 -3.14944575e+00 2.06807488e+02 4.81635908e+01 5.96362124e+00 2.29740771e+02
1716.lowfreq: -22.9171 -0.0024 -0.0017 0.0015 10.2248 13.3449 34.6786 40.9245 51.7966
frequency: 33.9820 40.7845 50.6316 63.0454 75.0158 84.2182 95.8210 110.8207 132.9174 135.0041 143.2983 163.9783 168.3508 180.9013 196.1560 213.6961 223.0140 237.5029 261.8085 296.3038 300.6733 312.8439 336.3181 353.9422 490.3378 499.0486 558.5374 600.3053 605.6733 620.8277 632.2461 686.3752 704.8963 835.4845 849.6111 961.0046 965.0153 1023.0911 1040.5726 1061.8690 1063.4378 1203.1651 1350.0932 1377.0390 1380.3720 1408.6506 1434.5933 1448.1932 1468.3341 1476.5545 1489.2799 1572.1530 1633.2705 1636.6435 1644.1027 1654.9987 1720.2914 3066.5355 3067.2184 3148.7252 3153.0854 3186.2296 3200.1291 3448.1313 3466.6095 3550.2552 3558.1591 3593.6920 3598.6435
redmass: 1.1426 8.0841 4.7942 4.0105 8.1769 8.6494 4.8927 3.2982 2.3062 3.7196 8.9829 4.0582 3.5429 4.4323 1.0835 4.4584 5.5740 3.7357 4.0929 5.5675 1.2659 10.7000 7.3377 5.3697 3.3185 4.2550 4.8656 2.3779 1.1877 2.8064 1.1363 6.7463 6.1910 1.1874 1.1502 6.1443 7.1734 1.4765 1.4796 1.8110 1.7752 1.1722 2.5984 1.2005 1.2555 1.7300 2.4339 1.3868 1.1560 1.0543 1.1119 6.9728 1.0623 1.0614 1.0529 1.0582 10.7944 1.0453 1.0366 1.0963 1.1022 1.1070 1.1003 1.0306 1.0277 1.0924 1.0930 1.0939 1.0937
irintensity: 1.2552 6.0845 4.7078 1.7954 0.8763 2.4866 5.4032 14.4582 10.9815 1.8891 33.6813 20.3239 3.0624 1.7311 2.3275 9.6809 10.0815 20.8170 13.0392 22.2944 15.4213 93.3162 38.6615 20.8799 7.6538 18.0282 25.7745 21.1823 43.4097 10.4106 70.9452 39.7956 31.8940 29.5238 63.9672 7.1406 33.4156 69.0835 31.7591 22.6435 16.9601 209.6403 854.0800 128.7070 50.4565 623.1087 61.3828 159.0666 53.4113 13.2953 30.8994 1008.8042 80.5456 48.6953 87.8391 120.0634 1046.4401 2.4116 1.5963 7.9319 0.8870 3.9645 10.3379 117.5617 70.7560 120.6046 128.6803 91.8843 97.9505
temp: 298.150 k
press: 1.00000 atm
elementType: 6 8 8 78 7 1 1 7 1 1 1 1 17 17 6 8 8 6 1 1 1 6 1 1 1
symmnumber: 1
zpe: 486548.2 jmol-1
zpe.correction: 0.185316 hartree
zpe.thermalcorrener: 0.204843 hartree
zpe.thermalcorrenthalpy: 0.205787 hartree
zpe.thermalcorrgfe: 0.134194 hartree
zpe.sumelectzpe: -1609.237145 hartree
zpe.sumelectthermal: -1609.217619 hartree
zpe.sumelectthermalent: -1609.216675 hartree
zpe.sumelectthermalfe: -1609.288268 hartree
dipole: -11.8738 -15.8122 1.3767
dipole: 19.8219
quadrupole: -65.4161 -461.2615 -90.2468
quadrupole: -88.6200 -63.9394 -57.3787
quadrupole: 140.2254 -255.6201 115.3947 -88.6200 -63.9394 -57.3787
hfenergy: -1609.4224619 hartree
pointgroup: C01 [X(C4H12Cl2N2O4Pt1)]
dipole: -4.6715106 -6.2210058 0.5416369 debye
dipolederiv: 2.8073057 -0.174609 1.0042308 -1.0225418 1.8448002 -0.8962495 1.1565213 -0.5092831 0.9899265 -2.2354332 0.0030892 -0.6464291 -0.1759108 -0.8912416 0.0372352 -0.5699236 0.0934659 -0.8224666 -2.0563271 0.5797354 -0.8152741 1.4386695 -1.1874883 0.7541457 -0.9905097 0.3950927 -0.8942674 2.4091532 -0.4288222 -0.141873 -0.4835549 2.0155644 -0.4089195 -0.2311913 -0.3736169 2.3215227 -0.4795165 0.0743673 0.0112661 0.1073653 -0.910871 -0.2750624 0.0160488 -0.2233653 -0.6144466 0.2525616 0.0149159 -0.0001724 0.0135242 0.2744547 0.0192604 -0.0041847 0.0490761 0.2834245 0.2888788 -0.0611083 -0.0276013 0.0351563 0.2193295 -0.0141153 0.0469495 -0.0264031 0.2822317 -0.4088703 -0.1443158 0.2785318 -0.1351914 -0.5946004 0.4009497 0.2939116 0.3569317 -0.9622662 0.2733273 -0.0507897 0.0599984 -0.0586177 0.2532714 0.0364727 0.0213931 0.0200152 0.3321017 0.3102891 0.0187674 -0.0606277 -0.0108968 0.2665414 0.0231145 -0.0199375 0.003159 0.25715 0.2780022 0.0384218 0.0297962 0.0030262 0.2367277 0.0204217 0.0236243 -0.0930793 0.2554932 0.3174351 -0.0123301 0.0284779 0.0214969 0.3386349 -0.0411467 0.0291601 0.0525989 0.1954049 -0.1131043 0.1826929 0.2334134 0.446612 -0.7393487 -0.0976705 0.3869653 -0.3205328 -0.192822 -0.4329461 -0.1573397 0.3154491 -0.1516103 -0.6591881 0.461316 0.3145486 0.4507222 -1.1767162 1.024405 -0.5920614 0.0430581 0.3766603 2.6312967 1.5436709 0.555891 0.4408393 0.9859861 -0.5035166 -0.0772894 -0.1067119 -0.4594426 -1.4313785 -0.8988451 -0.3165446 -0.4611605 -0.7695487 -1.5989858 0.9166051 -0.0757822 0.3898275 -1.4916055 -0.4581734 -0.4232735 0.1079935 -0.5194708 -0.1400002 0.009777 -0.0477857 -0.3143612 -0.1097645 -0.3099032 -0.2020124 -0.0135023 -0.1886448 0.036438 0.0602076 -0.0000388 0.0986806 0.0156357 -0.0264375 0.0189113 -0.0424643 0.1243617 -0.017409 -0.0125906 -0.0019513 -0.018269 0.1407559 -0.0226791 -0.0135074 -0.0074281 -0.0260154 -0.0052379 -0.0375629 -0.1028294 -0.0642328 -0.0036763 0.0336807 -0.086386 0.0375955 0.0382498 -0.1001078 -0.1440947 0.0202624 -0.0724486 -0.4024252 0.1377812 0.029268 0.1517139 -0.0372596 -0.0162985 0.114911 -0.0007313 0.0704673 0.0178606 0.0185058 -0.0072311 -0.0177929 0.1356815 0.0935156 -0.0282413 0.0796413 0.0068772 0.0884492 -0.0361209 0.0698899 -0.0043708 -0.0194867 0.0164414 -0.0923354 -0.0763175 -0.0412854 0.0782659 -0.0012313 -0.0983811 -0.0662042 0.0218766 unknown
polarizability: 250.501904|-3.1494457|206.8074885|48.1635908|5.9636212|229.7407711 unknown
InChI: InChI=1/2C2H3O2.ClH.Cl.2H3N.Pt/c2*1-2(3)4;;;;;/h2*1H3;1H;;2*1H3;/q2*-1;;;;;+3/p-1/rC4H12ClN2O4Pt.Cl/c1-3(8)10-12(5,6,7)11-4(2)9;/h1-2,6-7H3;
charge 0 multiplicity 3
25 atoms
C  -0.10884368 10.39882067 5.7237818
O  1.0342608 10.68524825 6.07839389
O  -0.87880821 11.3124915 5.18664887
Pt -2.7782897 11.20920198 4.47353516
N  -2.65077619 9.30406981 3.20521849
H  -3.16691326 9.50652865 2.34634889
H  -1.68477386 9.08404859 2.95267032
N  -3.49350904 10.26824103 6.17094423
H  -2.92620555 10.47679028 6.99938698
H  -4.44750928 10.58739358 6.37117396
H  -3.07161751 8.48215849 3.64559025
H  -3.53105774 9.24822483 6.06855658
Cl -3.47702114 13.55145893 5.76298086
Cl -2.06779517 12.38411919 2.55738068
C  -5.45115503 12.27974081 3.69867838
O  -5.21890432 13.39073073 4.23835093
O  -4.71577837 11.23511771 3.7648817
C  -6.70978532 12.15059431 2.87431423
H  -7.39366102 12.98166258 3.07390668
H  -6.42237473 12.15923416 1.81319218
H  -7.19438033 11.19113284 3.0937789
C  -0.63804204 8.99467624 5.94928288
H  0.20128454 8.29052248 5.91744916
H  -1.0778257 8.94319185 6.95723899
H  -1.39606492 8.68906391 5.221794
