program: Gaussian 16
title: TitleCard Required
version: ES64L-G16RevC.02
method: UM11
basis: Gen
operation: Freq
keyword: #PGeom=AllCheck
keyword: Guess=TCheck
keyword: SCRF=Check
keyword: GenChk
keyword: UM11/ChkBas
keyword: Freq
title: Title Card Required
converged: YES YES NO NO
polarizability: 2.21037537e+02 -1.06130163e+01 2.02113613e+02 4.01440341e+00 -3.88643906e-01 2.10568718e+02
1716.lowfreq: -17.5384 -0.0012 0.0014 0.0018 5.7043 13.5438 24.2602 53.7785 64.0384
frequency: -15.6962 53.7094 63.8603 78.1443 84.8939 90.6824 112.4304 123.7209 142.9306 153.5980 183.9488 190.4329 201.1463 214.1270 233.4015 245.9982 256.1020 267.0896 293.4675 294.7347 322.7220 336.5429 348.5322 541.2612 549.5188 557.9779 563.8045 615.6297 621.1746 710.4306 721.1238 875.0276 882.7540 909.0508 941.7074 968.0573 976.0788 1035.9962 1038.4311 1065.4222 1066.2244 1330.5869 1351.3511 1361.2121 1373.4803 1408.3463 1418.2217 1455.2924 1457.8072 1463.0311 1466.2661 1609.3531 1623.9540 1642.7170 1656.9214 1706.3013 1729.4084 3062.9718 3065.3652 3146.6085 3146.9075 3178.2359 3178.8228 3335.6520 3423.5883 3506.7619 3525.2556 3545.3876 3569.4174
redmass: 1.0348 3.4808 3.5102 2.2395 2.6485 2.6379 6.3549 4.4286 1.8754 5.7461 7.9819 6.2254 4.6344 3.5567 4.7496 1.8276 2.5318 3.0811 3.4757 3.9736 4.1180 28.8682 33.3161 4.6036 4.7705 4.3316 4.3628 2.6781 2.6168 7.0945 7.2585 1.2149 1.1639 1.2897 1.4488 5.6717 2.4855 1.5460 1.5366 1.8246 1.8386 2.0016 1.3816 1.7423 1.1868 1.7988 2.5569 1.0703 1.0738 1.0434 1.0801 1.0824 1.0816 1.0707 1.0709 6.4417 7.4411 1.0381 1.0368 1.1028 1.1001 1.1076 1.1065 1.0543 1.0308 1.0708 1.0930 1.0941 1.0937
irintensity: 1.7993 3.9240 2.1277 9.7307 8.5337 6.0974 1.5230 5.3119 1.1868 1.0213 3.3415 0.9984 11.1235 19.6019 2.5408 11.2627 25.4126 18.6235 1.0751 6.1042 128.5138 91.8826 85.4314 25.1930 21.1772 1.2277 1.1562 17.4736 13.5746 85.3249 92.1135 33.3301 18.0495 32.8315 13.4578 6.5920 76.1428 57.9942 26.4478 19.8685 17.0879 1021.8267 363.4364 45.3654 349.9998 733.6865 102.4172 39.8323 33.5737 19.7373 35.1222 120.1115 78.9784 163.9904 85.9327 353.3541 642.9489 2.3292 2.2083 1.9577 4.9515 6.8240 7.4524 406.3512 159.6825 228.0954 224.4118 152.2999 121.5183
temp: 298.150 k
press: 1.00000 atm
elementType: 6 8 8 78 7 1 1 7 1 1 1 1 17 17 6 8 8 6 1 1 1 6 1 1 1
symmnumber: 1
zpe: 494483.1 jmol-1
zpe.correction: 0.188339 hartree
zpe.thermalcorrener: 0.205753 hartree
zpe.thermalcorrenthalpy: 0.206698 hartree
zpe.thermalcorrgfe: 0.142295 hartree
zpe.sumelectzpe: -1609.328162 hartree
zpe.sumelectthermal: -1609.310748 hartree
zpe.sumelectthermalent: -1609.309803 hartree
zpe.sumelectthermalfe: -1609.374206 hartree
dipole: -0.6146 -9.7277 5.7353
dipole: 11.3093
quadrupole: -97.2318 -321.3029 -67.0839
quadrupole: 27.3025 -12.0762 26.1378
quadrupole: 64.6411 -159.4300 94.7889 27.3025 -12.0762 26.1378
hfenergy: -1609.516501 hartree
pointgroup: C01 [X(C4H12Cl2N2O4Pt1)]
dipole: -0.2417828 -3.827171 2.2564562 debye
dipolederiv: 1.7381473 0.08149 0.192938 -0.8565675 1.6528101 -1.1960534 0.9965095 -1.1257011 1.3996661 -1.003512 -0.4247709 0.2523524 0.1060651 -1.2478491 0.5879246 -0.2256885 0.5516728 -0.996718 -2.1539131 0.5536729 -0.6589359 0.7816583 -0.878736 0.5780224 -0.9594217 0.5800142 -0.927066 2.7124556 -0.2828563 0.0888816 -0.2251955 2.3939594 0.0805739 0.0309266 0.0816979 2.4162576 -0.3104751 -0.0731389 -0.015403 0.0128582 -1.4404256 -0.0455389 -0.0723624 -0.0097785 -0.2732946 0.3245558 0.1267456 -0.0064778 0.0472626 0.2627858 0.0040589 -0.0087143 -0.0341346 0.2963303 0.2947744 -0.0772046 -0.0058301 -0.0299552 0.2767077 0.064576 -0.0061081 0.0970807 0.3202144 -0.5047396 0.022471 0.1170598 0.1016912 -0.1992402 0.0659342 0.1691424 -0.0372598 -1.3950257 0.2599709 -0.0137218 0.0812272 -0.0137129 0.2839522 0.1130555 0.0529652 0.0551465 0.2894999 0.6750346 -0.0670507 0.0251741 -0.1376279 0.2903219 0.003467 0.0717088 0.0110869 0.3023284 0.4129497 -0.0151142 0.057938 0.0168544 0.283607 -0.0563547 0.1189181 -0.0779433 0.3284387 0.3286392 0.0308446 -0.0458013 0.0117122 0.2873641 -0.1442015 0.0088789 -0.074605 0.238358 -0.2459579 -0.0086202 -0.0343052 0.016286 -1.4403567 -0.0494639 -0.0158906 -0.0627014 -0.2585498 -0.2885947 0.0186379 0.2082912 0.0154997 -0.2933099 -0.0442489 0.1902695 -0.0185889 -1.4665731 2.2610913 -0.3662715 -0.079693 -0.9377967 0.7356247 0.6225372 -1.1591524 0.7215782 1.8415334 -1.0810248 0.0151294 -0.2195934 0.2697744 -0.6552491 -0.3560777 0.3311088 -0.4286961 -1.5511171 -2.7552621 0.5078187 0.2555407 0.6174752 -0.5429018 -0.2850405 0.6715439 -0.2544162 -0.7243714 -0.3830962 0.0052158 -0.2047994 0.1405456 -0.0095981 0.0649991 -0.076252 0.0148245 -0.1155315 -0.089835 0.0129999 0.0290288 0.0194543 0.1223045 -0.0264211 0.0692052 -0.0196207 0.0022603 0.0525566 -0.0360138 0.0005154 -0.0057116 0.0310052 0.0897636 -0.0152483 0.0827397 0.0721683 0.082828 0.0340977 -0.0032565 -0.0359908 -0.0140397 -0.10144 -0.0088667 -0.0720701 0.0963583 -0.4223414 -0.0905686 0.009096 0.0273902 -0.0486617 0.0157388 -0.1023906 0.0071818 -0.028323 -0.0442117 0.0217295 -0.0412313 0.049194 0.0327274 0.0878407 -0.0738417 0.0822177 0.0425204 0.0652007 0.0016424 0.0015886 0.0274219 0.1455903 -0.0173613 0.0514247 -0.0204812 -0.0347033 0.0747593 0.0228361 -0.0043052 -0.0185855 -0.0283925 -0.0562901 -0.0386643 -0.0492439 0.1253394 unknown
polarizability: 221.0375367|-10.6130163|202.1136132|4.0144034|-0.3886439|210.5687179 unknown
InChI: InChI=1/2C2H3O2.2ClH.2H3N.Pt/c2*1-2(3)4;;;;;/h2*1H3;2*1H;2*1H3;/q2*-1;;;;;+4/p-2/rC4H12Cl2N2O4Pt/c1-3(9)11-13(5,6,7,8)12-4(2)10/h1-2,7-8H3
charge 0 multiplicity 1
25 atoms
C  -0.19570082 10.17396161 5.15812397
O  -0.75963943 9.2970292 5.8173608
O  -0.80982518 10.99198161 4.33790135
Pt -2.81486718 10.92608437 4.05730567
N  -2.86043703 8.87753978 3.98508514
H  -3.83196582 8.54631659 4.00492471
H  -2.4298441 8.53568366 3.11804073
N  -3.09628462 10.94486126 6.08735099
H  -2.35911509 11.49120331 6.54485796
H  -4.01286432 11.39451396 6.24940912
H  -2.34077376 8.48141412 4.77879676
H  -3.09437384 10.00745206 6.50207859
Cl -2.82744967 13.26596887 4.13501449
Cl -2.43468581 10.91987369 1.74087503
C  -5.76532599 11.3469059 4.3293388
O  -5.6402842 11.81089541 5.46333167
O  -4.79240727 10.84332556 3.60797313
C  -7.09579318 11.31902113 3.61468885
H  -7.91137737 11.43652403 4.3364185
H  -7.12233061 12.15756609 2.90315322
H  -7.2142108 10.38824858 3.0471557
C  1.2931599 10.41490058 5.22202289
H  1.75837804 9.7016247 5.9102997
H  1.72692624 10.30558488 4.21888171
H  1.48498294 11.44200003 5.56093049
