program: Gaussian 16
title: Title Card Required
version: ES64L-G16RevC.01
frameworkgroup: C2V[C2(CC),SGV(C22H14)]
method: RM062X
basis: 6-311+G(d)
operation: Freq
keyword: #P
keyword: Geom=AllCheck
keyword: Guess=TCheck
keyword: SCRF=Check
keyword: Test
keyword: GenChk
keyword: RM062X/6-311+G(d)Freq
converged: YES YES YES YES
title: Mulliken charges:
elementType: C C C C C C C C C C C C C C C C C C C C C C C C H H H H H H H H H H H H H H
charge: 0.386853 0.545014 -0.270956 -0.940824 -0.630004 -0.220641 0.589459 -0.651247 -0.719575 0.432583 -0.184864 0.432583 -0.719575 -0.651247 0.589459 0.545014 -0.270956 -0.940824 -0.630004 -0.220641 0.386853 -0.272686 0.038297 -0.272686 0.258907 0.248091 0.247096 0.259382 0.263000 0.268440 0.268440 0.263000 0.258907 0.248091 0.247096 0.259382 0.280391 0.280391
chargesum: 0.00000
title: Mulliken charges with hydrogens summed into heavy atoms:
elementType: C C C C C C C C C C C C C C C C C C C C C C C C
charge: 0.386853 0.545014 -0.012050 -0.692733 -0.382908 0.038741 0.589459 -0.388247 -0.451135 0.432583 -0.184864 0.432583 -0.451135 -0.388247 0.589459 0.545014 -0.012050 -0.692733 -0.382908 0.038741 0.386853 0.007706 0.038297 0.007706
polarizability: 1.25885320e+02 2.64439171e-14 7.43796340e+02 2.55409181e-14 -2.14239938e-06 2.72971045e+02
1716.lowfreq: -1945.4994 -0.0004 -0.0004 0.0003 3.4650 5.9267 17.1535 28.7958 61.2545
frequency: -1945.4994 28.6810 61.2545 89.3445 95.6678 130.1187 156.8039 185.1941 218.9369 224.4160 250.7246 271.2427 315.7122 367.8892 390.0802 419.2486 433.3734 456.5328 465.3337 515.2457 515.4812 515.7593 522.2286 541.4089 546.7058 582.7115 599.8982 637.6065 644.1114 672.1724 692.5258 698.8206 713.8910 753.3286 761.7569 769.1059 769.9688 772.3867 775.0473 839.4907 852.5658 874.1802 879.8490 881.2374 886.8037 887.0521 887.3376 921.7444 926.2087 975.8737 976.6861 999.1367 1002.1128 1010.6193 1010.8896 1046.2476 1062.4978 1066.0335 1066.5037 1111.7145 1145.7257 1174.7566 1175.9194 1186.7205 1188.5370 1209.6494 1217.3892 1244.7723 1247.1880 1282.5023 1288.7797 1289.0420 1318.5722 1324.3445 1369.3609 1378.3769 1379.3106 1389.5172 1437.7215 1454.5953 1472.2644 1482.4808 1499.8563 1510.6985 1528.2127 1560.8423 1577.0542 1606.4049 1610.3898 1623.1173 1654.6861 1660.2093 1688.8982 1690.1845 3194.3432 3194.7143 3197.4279 3197.7084 3203.1691 3203.2130 3217.1877 3217.2010 3222.3748 3226.5291 3230.2904 3230.3851 3244.8357 3245.2152
redmass: 11.4233 6.4002 4.2844 5.5129 5.1833 3.8637 5.7186 3.7852 6.6947 5.1168 3.5526 4.9881 6.1556 3.1091 5.1378 3.1804 2.9041 7.8979 4.7748 5.7335 3.2621 6.5187 3.1205 3.3128 3.3113 6.9514 4.5087 6.2556 5.9647 3.9436 3.8199 5.8767 3.5218 3.7087 5.5456 1.5133 1.3290 3.2243 6.2730 1.4556 1.5672 1.6304 7.0414 4.3564 1.4388 1.4436 4.1753 5.6291 1.5868 1.3316 1.3369 1.3563 1.3503 1.3063 1.3083 3.1574 2.9626 2.0755 2.0585 3.2264 1.8268 1.2789 1.2574 1.1887 1.1757 1.4423 1.6164 1.9542 2.0228 2.1600 1.9038 2.6207 2.0637 2.5120 3.2378 5.1055 7.9071 3.6975 3.8930 2.2741 2.5067 2.8002 2.3956 4.0183 5.4793 5.0354 4.4794 5.6346 5.6112 6.0912 6.2886 7.1301 6.1402 6.1024 1.0884 1.0887 1.0878 1.0879 1.0880 1.0880 1.0937 1.0937 1.0948 1.0943 1.0972 1.0972 1.0951 1.0941
irintensity: 1322.1133 0.7051 0.0000 0.2769 0.0000 0.0347 0.0809 0.0000 0.0450 0.0014 15.3290 0.0000 0.0008 0.0000 0.3126 8.1953 0.0000 15.9593 17.8839 0.4369 9.9858 1.5096 0.0000 0.0350 0.0000 82.1881 0.4804 0.6973 0.8021 3.2551 0.0000 18.6044 6.2027 0.0000 0.8215 90.2169 0.0000 18.2358 17.2863 0.0000 91.9588 0.0000 120.2638 2.1288 0.0000 4.7805 1.0381 1.3211 27.8686 0.0000 3.8374 0.0000 0.9441 0.0000 0.0164 9.0965 0.0026 25.3267 0.0529 0.4356 16.8914 116.2121 1.7218 18.9055 9.6896 30.7462 37.9483 16.7637 9.1080 13.9850 0.0001 9.5881 37.4675 2.0869 81.3593 1.9400 73.2855 3.6765 0.0749 55.0543 28.7106 1.2839 2.0565 1.1809 23.4073 169.2487 25.3298 34.7776 5.5760 1025.1487 35.4130 2319.5451 52.1335 3.8475 1.6191 0.7723 6.8339 15.0249 0.1483 2.9798 0.9646 27.3233 3.6027 19.8926 62.0715 0.6709 0.9674 11.3547
temp: 298.150 k
press: 1.00000 atm
elementType: 6 6 6 6 6 6 6 6 6 6 6 6 6 6 6 6 6 6 6 6 6 6 6 6 1 1 1 1 1 1 1 1 1 1 1 1 1 1
symmnumber: 2
zpe: 781270.2 jmol-1
zpe.correction: 0.297570 hartree
zpe.thermalcorrener: 0.313705 hartree
zpe.thermalcorrenthalpy: 0.314649 hartree
zpe.thermalcorrgfe: 0.254448 hartree
zpe.sumelectzpe: -922.472618 hartree
zpe.sumelectthermal: -922.456484 hartree
zpe.sumelectthermalent: -922.455539 hartree
zpe.sumelectthermalfe: -922.515740 hartree
dipole: 0.0000 0.0000 -0.0808
dipole: 0.0808
quadrupole: -150.3989 -117.4880 -116.0695
quadrupole: 0.0000 0.0000 0.0000
quadrupole: -22.4134 10.4974 11.9160 0.0000 0.0000 0.0000
hfenergy: -922.7701883 hartree
pointgroup: C02V [C2(C1C1),SGV(C22H14)]
dipole: 0. 0. 0.0317886 debye
dipolederiv: -0.0923553 0. 0. 0. -1.2533765 -0.144554 0. -1.8790033 -0.4881996 0.0398427 0. 0. 0. 1.615759 0.1722476 0. -0.2815372 -0.0013138 -0.1473559 0. 0. 0. -0.8603967 -0.1031921 0. 0.3599033 0.1152772 -0.1307906 0. 0. 0. 0.3511378 0.1029792 0. 0.2859487 0.2364203 -0.1685268 0. 0. 0. -0.0813966 0.0910329 0. -0.1221036 -0.3153952 -0.1325368 0. 0. 0. 0.1682429 -0.1745022 0. 0.2512787 0.2046619 -0.004613 0. 0. 0. -0.2024829 0.1346592 0. -0.3402302 -0.3588195 -0.0994591 0. 0. 0. 0.6963041 -0.0958254 0. -0.5174949 0.2934211 -0.1643646 0. 0. 0. -1.2038311 -0.1024656 0. -0.4604956 -0.0061272 0.0969001 0. 0. 0. 0.7271552 0.0935813 0. 1.2280346 0.2583466 -0.1420498 0. 0. 0. -1.8410795 -0.0000004 0. 0. -0.1572595 0.0969002 0. 0. 0. 0.727155 -0.0935813 0. -1.2280348 0.2583464 -0.1643646 0. 0. 0. -1.2038308 0.1024656 0. 0.4604955 -0.0061271 -0.0994591 0. 0. 0. 0.6963037 0.0958252 0. 0.5174954 0.2934212 -0.004613 0. 0. 0. -0.2024827 -0.1346592 0. 0.3402303 -0.3588198 0.0398427 0. 0. 0. 1.6157593 -0.1722473 0. 0.2815374 -0.0013137 -0.147356 0. 0. 0. -0.8603965 0.1031922 0. -0.3599033 0.1152772 -0.1307906 0. 0. 0. 0.3511373 -0.1029794 0. -0.2859486 0.2364205 -0.1685268 0. 0. 0. -0.0813969 -0.0910328 0. 0.1221035 -0.3153955 -0.1325369 0. 0. 0. 0.1682427 0.1745024 0. -0.2512784 0.2046619 -0.0923553 0. 0. 0. -1.2533763 0.1445542 0. 1.8790028 -0.4881996 -0.0379639 0. 0. 0. 3.0705892 -0.1990864 0. -0.9121312 0.38321 -0.0979326 0. 0. 0. -4.3131877 0.0000002 0. 0.0000002 -0.0934662 -0.0379639 0. 0. 0. 3.0705893 0.1990863 0. 0.9121312 0.3832099 0.1298411 0. 0. 0. 0.0561659 -0.0873164 0. -0.0132252 -0.0489165 0.1418795 0. 0. 0. -0.0161109 0.076822 0. 0.1171742 -0.0370994 0.1519344 0. 0. 0. -0.144556 -0.0167608 0. -0.0197618 0.0671326 0.1364793 0. 0. 0. 0.0424356 -0.0241299 0. -0.105826 -0.0724119 0.1282606 0. 0. 0. 0.0059801 -0.0822659 0. -0.0366911 -0.0516029 0.1378807 0. 0. 0. 0.0168387 0.0907505 0. -0.0196426 -0.0271849 0.1378807 0. 0. 0. 0.0168387 -0.0907505 0. 0.0196426 -0.0271848 0.1282607 0. 0. 0. 0.0059802 0.0822659 0. 0.036691 -0.0516028 0.1298411 0. 0. 0. 0.056166 0.0873164 0. 0.0132252 -0.0489165 0.1418795 0. 0. 0. -0.0161109 -0.076822 0. -0.1171742 -0.0370994 0.1519344 0. 0. 0. -0.1445558 0.0167607 0. 0.0197617 0.0671327 0.1364793 0. 0. 0. 0.0424358 0.0241298 0. 0.1058259 -0.0724119 0.1349388 0. 0. 0. 0.0886756 -0.0532436 0. -0.0417269 -0.0260358 0.1349388 0. 0. 0. 0.0886757 0.0532436 0. 0.0417268 -0.0260359 unknown
polarizability: 125.8853202|0.|743.7963403|0.|0.0000021|272.9710455 unknown
InChI: InChI=1/C24H14/c1-3-7-18-15(5-1)9-11-20-22(18)13-17-14-23-19-8-4-2-6-16(19)10-12-21(23)24(17)20/h1-14H
charge 0 multiplicity 1
38 atoms
C  0.0000 2.18300599 -0.56311688
C  0.0000 3.61273399 -0.46546585
C  0.0000 4.47623802 -1.57945584
C  0.0000 5.84370302 -1.41189381
C  0.0000 6.40999399 -0.12396679
C  0.0000 5.58722196 0.9789082
C  0.0000 4.18376096 0.83577917
C  0.0000 3.32761893 1.98539515
C  0.0000 1.96234394 1.89799212
C  0.0000 1.35340597 0.6216551
C  0.0000 0.0000 0.19270007
C  0.0000 -1.35340597 0.6216551
C  0.0000 -1.96234394 1.89799212
C  0.0000 -3.32761893 1.98539515
C  0.0000 -4.18376096 0.83577917
C  0.0000 -3.61273399 -0.46546585
C  0.0000 -4.47623802 -1.57945584
C  0.0000 -5.84370302 -1.41189381
C  0.0000 -6.40999399 -0.12396679
C  0.0000 -5.58722196 0.9789082
C  0.0000 -2.18300599 -0.56311688
C  0.0000 -1.33684998 -1.68687497
C  0.0000 0.0000 -1.22064493
C  0.0000 1.33684998 -1.68687497
H  0.0000 4.05660204 -2.57972385
H  0.0000 6.49093004 -2.2820518
H  0.0000 7.48702998 -0.00478577
H  0.0000 6.01099094 1.97856321
H  0.0000 3.80046591 2.96339917
H  0.0000 1.35601391 2.79640911
H  0.0000 -1.35601391 2.79640911
H  0.0000 -3.80046591 2.96339917
H  0.0000 -4.05660204 -2.57972385
H  0.0000 -6.49093004 -2.2820518
H  0.0000 -7.48702998 -0.00478577
H  0.0000 -6.01099094 1.97856321
H  0.0000 -1.65667395 -2.72171398
H  0.0000 1.65667395 -2.72171398
