program: Gaussian 16
title: Title Card Required
version: ES64L-G16RevC.01
frameworkgroup: CS[SG(C24H12F2)]
method: RM062X
basis: 6-311+G(d)
operation: Freq
keyword: #P
keyword: Geom=AllCheck
keyword: Guess=TCheck
keyword: SCRF=Check
keyword: GenChk
keyword: RM062X/6-311+G(d)
keyword: Freq
converged: YES YES YES YES
title: Mulliken charges:
elementType: C C C C C C C C C C C C C C C C C C C C C C C C H H H H H H H H H H H H F F
charge: 0.412511 0.670635 -0.419678 -0.790482 -0.606568 -0.273139 0.949216 -0.818446 -0.803826 0.652467 -0.090276 0.264607 -0.639017 -0.617111 0.675148 0.528068 -0.155669 -0.686640 -0.646666 -0.281435 0.434965 -0.330559 -0.005544 -0.312217 0.270329 0.270363 0.280392 0.262258 0.270155 0.273283 0.263437 0.272976 0.271695 0.281925 0.271067 0.280777 -0.191370 -0.187632
chargesum: 0.00000
title: Mulliken charges with hydrogens summed into heavy atoms:
elementType: C C C C C C C C C C C C C C C C C C C C C C C C F F
charge: 0.412511 0.670635 -0.149349 -0.520119 -0.606568 0.007253 0.949216 -0.556188 -0.533671 0.652467 -0.090276 0.264607 -0.365734 -0.353674 0.675148 0.528068 0.117307 -0.414945 -0.646666 0.000490 0.434965 -0.059492 -0.005544 -0.031440 -0.191370 -0.187632
polarizability: 6.05417417e+02 3.51591312e+01 2.67735284e+02 0.00000000e+00 0.00000000e+00 1.23813823e+02
1716.lowfreq: -2.8890 -0.0008 -0.0006 -0.0004 1.5893 10.3525 23.1289 53.1935 68.0502
frequency: 23.1232 53.1863 68.0484 72.7940 111.9366 138.6612 176.5828 183.5224 192.8869 199.3947 242.1739 292.0247 308.9733 341.5030 359.7552 363.8437 410.9325 416.3794 426.4428 432.5500 462.4839 487.2407 492.4646 506.5546 516.5814 534.1699 554.3789 583.6713 593.6180 605.5221 609.8548 628.6279 645.8296 668.7990 681.6935 705.2107 731.2875 738.3046 741.0821 758.1587 809.1591 817.8659 821.2609 821.4155 830.7995 839.3905 846.1736 855.3829 895.9202 905.9000 913.9793 916.5282 972.4221 976.1423 976.3824 979.9793 982.2967 1010.3047 1019.0542 1032.7071 1071.6934 1127.3770 1161.9889 1166.7138 1173.0522 1176.5064 1182.3872 1195.3938 1227.5047 1253.1250 1262.7611 1274.4104 1281.7820 1297.9541 1303.9240 1336.3113 1355.1490 1367.0080 1387.4260 1405.3527 1424.3621 1440.0118 1464.5070 1489.9129 1520.3010 1536.2587 1586.0085 1603.9818 1632.7314 1638.6538 1661.2475 1668.0908 1675.7340 1689.9699 1710.8787 1720.7749 3200.3373 3207.8173 3219.6499 3219.9870 3222.7193 3224.6133 3226.6245 3228.6832 3239.3431 3242.2365 3247.1167 3263.5071
redmass: 10.5740 4.5887 8.0752 8.1981 5.9908 5.2923 3.8125 7.9246 8.4605 7.7535 3.8252 6.4482 8.8479 3.5766 8.7608 6.2057 5.3309 8.3269 3.2267 3.0017 5.1410 6.0998 4.6859 7.0561 3.0328 3.1908 8.2663 6.6493 3.4558 3.6576 4.5860 5.7041 6.8003 3.6366 3.6818 3.4858 6.9152 4.0266 6.7374 5.1955 5.2892 1.5672 5.8326 1.4465 1.6236 1.5386 1.5720 5.8070 1.5245 1.4960 1.5714 5.1946 1.3346 1.3275 3.0058 3.5951 1.3133 1.3062 4.5939 3.2228 3.4059 1.7674 1.3537 1.2131 1.6731 1.5158 1.5462 1.5919 2.4306 2.6001 3.1719 2.4387 2.4706 1.7631 2.2619 4.8196 3.8851 4.1332 2.4460 3.5412 2.7855 3.9906 5.4912 4.1986 3.0893 3.5234 5.2237 8.1216 7.9376 6.6540 7.1981 7.5903 8.2551 6.6907 8.0466 7.9125 1.0876 1.0881 1.0893 1.0884 1.0960 1.0925 1.0951 1.0927 1.0960 1.0950 1.0955 1.0958
irintensity: 0.0116 0.0303 0.0003 0.0923 1.1332 0.2669 0.0004 0.0444 0.0665 0.0236 7.3085 3.9815 1.9818 0.7091 4.3481 0.0005 0.1222 0.8609 9.8956 0.0841 3.5589 10.4445 15.7513 0.2029 4.7664 2.2934 0.7459 4.1976 0.2521 0.0018 1.1865 17.1030 40.3673 0.3860 0.1250 21.0909 1.5935 0.0027 0.0733 2.1889 6.6990 0.5143 3.3953 0.0493 29.1983 54.3108 9.2855 43.5716 54.3559 52.7958 14.8145 9.5498 0.3261 0.1521 73.5171 1.3458 0.1370 0.2219 21.7991 0.7071 16.8680 17.3817 7.6697 14.8186 20.7836 0.2507 18.7754 98.4778 9.0641 0.4122 72.2311 4.0666 203.7306 1.2992 73.6420 78.8903 2.1353 31.5104 21.4473 0.0013 2.0979 22.7065 14.6702 50.3547 52.3075 125.3864 61.0762 0.3024 20.6537 62.0155 62.5822 28.2625 26.8666 96.8468 29.6056 207.0960 3.1465 3.1013 3.6092 1.6309 2.5924 3.8499 17.3853 7.8199 2.2778 2.2930 6.1627 4.3461
temp: 298.150 k
press: 1.00000 atm
elementType: 6 6 6 6 6 6 6 6 6 6 6 6 6 6 6 6 6 6 6 6 6 6 6 6 1 1 1 1 1 1 1 1 1 1 1 1 9 9
symmnumber: 1
zpe: 744658.6 jmol-1
zpe.correction: 0.283625 hartree
zpe.thermalcorrener: 0.301648 hartree
zpe.thermalcorrenthalpy: 0.302593 hartree
zpe.thermalcorrgfe: 0.237261 hartree
zpe.sumelectzpe: -1120.980798 hartree
zpe.sumelectthermal: -1120.962775 hartree
zpe.sumelectthermalent: -1120.961831 hartree
zpe.sumelectthermalfe: -1121.027162 hartree
dipole: 0.6184 -0.3931 0.0000
dipole: 0.7328
quadrupole: -171.3157 -122.5127 -156.8224
quadrupole: -1.8176 0.0000 0.0000
quadrupole: -21.0987 27.7042 -6.6055 -1.8176 0.0000 0.0000
hfenergy: -1121.2644231 hartree
pointgroup: CS [SG(C24H12F2)]
dipole: 0.2348366 -0.1672154 0. debye
dipolederiv: 0.1161342 0.0839211 0. -0.6771081 -0.1544731 0. 0. 0. -0.0212934 0.0661951 -0.024961 0. 0.2953609 -0.1094801 0. 0. 0. 0.0201138 0.1377549 0.1129104 0. 0.1014696 0.1131044 0. 0. 0. -0.1381077 -0.380653 -0.0679742 0. 0.2038158 0.1176534 0. 0. 0. -0.1364465 1.9812534 0.0131481 0. -0.2694109 0.1658934 0. 0. 0. 0.1019087 -0.1179586 0.0368214 0. -0.3085613 -0.0044614 0. 0. 0. -0.1542703 0.089002 0.0021627 0. -0.0071769 -0.1568114 0. 0. 0. -0.0060736 0.2448019 0.0152608 0. 0.1518091 0.1178321 0. 0. 0. -0.1503242 -0.5509044 0.0315965 0. 0.2509855 0.1402863 0. 0. 0. -0.1300195 1.2320607 -0.1413978 0. -0.1905567 -0.1397562 0. 0. 0. 0.0179752 -0.9330727 0.0552433 0. 0.1014681 -0.0895365 0. 0. 0. -0.0522784 0.1658717 0.0390727 0. 0.7032501 0.17217 0. 0. 0. 0.0584852 -0.3807232 0.016834 0. 0.094091 0.0139614 0. 0. 0. -0.1377845 0.1148155 -0.0573837 0. -0.3274788 0.2354612 0. 0. 0. -0.1337868 0.3118447 0.0388901 0. -0.3452782 -0.0632906 0. 0. 0. 0.0059524 0.3437551 0.0887516 0. 0.1896835 -0.1563608 0. 0. 0. 0.0106915 -0.1768453 -0.0700672 0. 0.0366867 0.1266499 0. 0. 0. -0.1201393 -0.15389 0.0404731 0. -0.0989365 -0.0309087 0. 0. 0. -0.1420469 2.0569007 0.1525813 0. 0.0212772 0.1743175 0. 0. 0. 0.1072973 -0.4667824 -0.0713574 0. 0.4919131 0.0631027 0. 0. 0. -0.1432773 0.1374263 0.0515326 0. -0.7300306 -0.1257977 0. 0. 0. -0.0353327 0.6422785 -0.0169839 0. 0.193501 0.045019 0. 0. 0. -0.1617761 -1.1054759 0.0262259 0. 0.250024 -0.0948973 0. 0. 0. -0.0280746 0.196146 -0.1154649 0. -0.1435163 0.3033361 0. 0. 0. -0.0870224 0.0735439 0.0781635 0. 0.0327001 -0.0314148 0. 0. 0. 0.1306743 0.0230455 -0.0486947 0. -0.0655968 0.0102658 0. 0. 0. 0.1599282 0.0408555 0.0090499 0. 0.0827787 -0.0083755 0. 0. 0. 0.1620654 0.0039092 0.0792169 0. 0.0565235 -0.0436309 0. 0. 0. 0.1405183 0.0279754 -0.0956227 0. -0.0453311 -0.0171267 0. 0. 0. 0.1339048 0.0199909 0.080959 0. -0.0074338 -0.0300239 0. 0. 0. 0.1353973 -0.0095585 -0.072345 0. -0.0166738 -0.053864 0. 0. 0. 0.1345947 0.0716123 -0.0744338 0. -0.029716 -0.0299079 0. 0. 0. 0.1252454 0.0166147 0.044496 0. 0.069914 0.0258604 0. 0. 0. 0.1639789 0.0741304 -0.0158357 0. -0.0651516 -0.0177513 0. 0. 0. 0.1600747 0.0369958 0.0627882 0. 0.0658133 -0.0192097 0. 0. 0. 0.1583456 0.0363702 -0.0346328 0. 0.0073766 -0.0348805 0. 0. 0. 0.1406354 -2.0072896 -0.1048391 0. 0.1351577 -0.1968469 0. 0. 0. -0.1448282 -1.9781308 -0.1481055 0. -0.207642 -0.2161081 0. 0. 0. -0.1449048 unknown
polarizability: 608.1712011|17.2822863|264.9814996|0.|0.|123.8138232 unknown
InChI: InChI=1/C24H12F2/c25-16-3-7-18-13(9-16)1-5-20-22(18)11-15-12-23-19-8-4-17(26)10-14(19)2-6-21(23)24(15)20/h1-12H
charge 0 multiplicity 1
38 atoms
C  -2.17687768 -0.50568309 0.0000
C  -3.58273945 -0.42926072 0.0000
C  -4.43009587 -1.57349238 0.0000
C  -5.78975339 -1.44169774 0.0000
C  -6.35126759 -0.14727644 0.0000
C  -5.59602819 0.98274321 0.0000
C  -4.1787649 0.87229714 0.0000
C  -3.35319515 2.01983383 0.0000
C  -1.97710278 1.91773522 0.0000
C  -1.3856258 0.64927841 0.0000
C  0.01030219 0.19618872 0.0000
C  1.30832045 0.599043 0.0000
C  1.93270663 1.89586198 0.0000
C  3.27738192 1.98799109 0.0000
C  4.15613539 0.81957839 0.0000
C  3.61762776 -0.48640559 0.0000
C  4.48749738 -1.58032493 0.0000
C  5.8630508 -1.40645057 0.0000
C  6.36464161 -0.1134726 0.0000
C  5.54342187 0.99488144 0.0000
C  2.16747211 -0.63037072 0.0000
C  1.3767591 -1.73529063 0.0000
C  -0.00686804 -1.25958586 0.0000
C  -1.28861661 -1.69357515 0.0000
H  -3.98839674 -2.5633937 0.0000
H  -6.45012412 -2.30048604 0.0000
H  -6.07549562 1.95509392 0.0000
H  -3.82417414 2.99721433 0.0000
H  -1.3657776 2.81307872 0.0000
H  1.31797974 2.78874224 0.0000
H  3.75427679 2.9631348 0.0000
H  4.0809624 -2.58546353 0.0000
H  6.54603851 -2.24696733 0.0000
H  5.98384802 1.98574718 0.0000
H  1.69237325 -2.7689093 0.0000
H  -1.62997851 -2.72118929 0.0000
F  -7.69276866 -0.05454666 0.0000
F  7.6958995 0.064338 0.0000
