program: Gaussian 16
title: Title Card Required
version: ES64L-G16RevC.01
frameworkgroup: C1[X(C24H16N2)]
method: RM062X
basis: 6-311+G(d)
operation: Freq
keyword: #P
keyword: Geom=AllCheck
keyword: Guess=TCheck
keyword: SCRF=Check
keyword: GenChk
keyword: RM062X/6-311+G(d)
keyword: Freq
converged: YES YES YES YES
title: Mulliken charges:
elementType: H C C H C C H C C C C H C C H C C C H C H C C H C C H C H C C C C H C H N H H N H H
charge: 0.263963 -0.546214 -0.712440 0.231402 -0.957468 -0.347099 0.236444 1.172201 0.618560 0.472147 -0.329788 0.275009 -0.020697 -0.344536 0.263737 0.482589 0.485527 -0.248664 0.265498 -0.511885 0.229410 -1.028011 -0.460405 0.240137 0.893871 -0.572169 0.255680 -0.645925 0.269004 0.334861 -0.077616 0.738079 -0.830513 0.264501 -0.766250 0.253065 -0.585380 0.331261 0.327092 -0.581196 0.330929 0.331294
chargesum: 0.00000
title: Mulliken charges with hydrogens summed into heavy atoms:
elementType: C C C C C C C C C C C C C C C C C C C C C C C C N N
charge: -0.282252 -0.481038 -0.957468 -0.110655 1.172201 0.618560 0.472147 -0.054780 -0.020697 -0.080800 0.482589 0.485527 0.016834 -0.282475 -1.028011 -0.220268 0.893871 -0.316489 -0.376921 0.334861 -0.077616 0.738079 -0.566012 -0.513185 0.072973 0.081026
polarizability: 7.02117008e+02 -2.59195412e+01 2.77979397e+02 1.79340197e-02 -9.84096194e-02 1.36988402e+02
1716.lowfreq: -0.0009 0.0005 0.0008 2.2388 4.1865 13.1705 23.8217 54.5087 67.8227
frequency: 23.8180 54.5074 67.8195 73.8730 109.1432 139.1652 175.5753 182.6827 191.6460 194.4411 240.0911 268.0158 268.7662 282.1881 300.6437 337.2123 350.5219 352.1667 409.7941 416.4097 422.0332 427.8173 451.2861 484.8942 493.2809 510.0419 515.1884 531.3539 558.8458 573.0234 583.2815 595.0224 610.4168 612.9303 629.7305 639.8650 656.6834 673.5452 686.0669 708.0178 736.3653 744.8709 746.9151 761.9970 806.2450 814.1355 817.8583 822.2890 830.7704 832.8765 840.5143 856.2433 882.9035 890.6844 906.6497 917.2794 966.2520 969.1778 972.9235 974.0439 979.8901 1004.8076 1015.9570 1028.1785 1071.2741 1115.9853 1127.4375 1140.2212 1169.4540 1178.3478 1186.0910 1195.6879 1202.5876 1211.0149 1232.2317 1259.9306 1274.9819 1278.2958 1293.8589 1316.7543 1339.1677 1350.4804 1356.7887 1368.8295 1391.3280 1415.7676 1435.6802 1453.1775 1475.5665 1504.7377 1526.1845 1542.7253 1585.2551 1611.1958 1634.5755 1637.3558 1657.2524 1663.7633 1679.1296 1689.9644 1700.9344 1709.6043 1714.2627 1721.5818 3186.3910 3186.7903 3195.0876 3196.0891 3196.9456 3200.2173 3215.5398 3218.0193 3218.9751 3222.4994 3244.4457 3264.1422 3593.8794 3599.5746 3692.0152 3698.9720
redmass: 6.2796 4.4239 5.0613 5.6769 4.7338 4.5674 3.6871 5.3807 5.2731 6.5622 3.6241 1.0891 1.0554 4.3737 4.3583 3.3867 4.4814 4.4354 4.9848 6.5882 3.1422 2.9582 3.7229 4.5687 5.0908 6.3750 2.9229 2.9904 4.4872 1.8843 6.3390 2.1489 3.7845 2.7943 4.8703 2.3296 3.6985 3.2523 3.4121 3.2276 5.7283 5.6011 3.7797 4.9532 1.7188 3.4921 1.6343 5.2123 1.7305 1.5216 1.5642 5.5941 1.6042 1.5803 1.5707 5.5608 2.9108 1.3343 3.1395 1.3325 1.3089 1.3064 4.2720 3.1279 3.5492 1.4980 1.4034 1.9230 1.5854 1.2889 1.3005 1.3922 1.7791 1.5554 2.2946 2.2903 2.0104 2.3023 2.2286 2.2219 2.3143 4.1352 4.0828 3.7928 2.5168 3.3094 2.5469 3.1771 4.3723 3.7915 3.0450 3.3855 4.8575 8.2746 6.6092 6.7919 6.2210 6.3944 8.1703 4.1548 1.8523 1.3257 2.9109 3.8915 1.0904 1.0905 1.0879 1.0881 1.0875 1.0878 1.0943 1.0949 1.0954 1.0957 1.0952 1.0954 1.0484 1.0483 1.0982 1.0988
irintensity: 1.5762 0.4300 0.2677 0.8778 1.3614 1.2412 0.9905 0.0766 0.2072 0.0285 14.2912 5.6684 45.3984 8.4628 0.3110 2.2633 0.8823 0.3494 15.6615 3.7559 12.7117 0.5198 0.0118 23.7541 9.4546 0.3550 11.7055 23.2857 37.5500 468.1415 10.9203 102.2423 65.4034 210.4644 11.9511 168.9681 49.6267 32.3248 1.3808 20.3890 13.5973 0.0265 0.9890 0.6739 1.2086 4.5674 2.5096 4.3952 19.2106 54.8570 27.9117 21.5232 53.1232 55.5899 18.5936 12.5138 11.4833 0.5116 2.2112 0.0890 0.2114 0.1647 8.9106 1.1707 3.7655 3.8624 3.6958 10.5752 19.2762 3.7815 1.6871 46.7353 24.9654 80.3110 6.9774 0.9970 2.7220 27.9291 103.7572 28.5014 51.4459 104.5103 0.8613 52.1137 28.0633 0.9389 3.1002 45.4642 41.8280 28.1619 52.1763 105.4025 42.9011 2.3342 2.6404 34.3956 48.2755 2.9664 51.9914 102.9416 9.3267 268.9598 1.6892 410.2403 21.4533 23.4436 12.1965 13.9413 6.3906 9.4471 11.3938 11.7170 3.1798 24.0487 7.2717 6.2634 36.7257 45.4222 14.4492 16.8023
temp: 298.150 k
press: 1.00000 atm
elementType: 1 6 6 1 6 6 1 6 6 6 6 1 6 6 1 6 6 6 1 6 1 6 6 1 6 6 1 6 1 6 6 6 6 1 6 1 7 1 1 7 1 1
symmnumber: 1
zpe: 876089.2 jmol-1
zpe.correction: 0.333685 hartree
zpe.thermalcorrener: 0.353058 hartree
zpe.thermalcorrenthalpy: 0.354002 hartree
zpe.thermalcorrgfe: 0.286615 hartree
zpe.sumelectzpe: -1033.147425 hartree
zpe.sumelectthermal: -1033.128052 hartree
zpe.sumelectthermalent: -1033.127108 hartree
zpe.sumelectthermalfe: -1033.194495 hartree
dipole: -0.7065 -0.0302 -0.0235
dipole: 0.7075
quadrupole: -93.3149 -128.6383 -164.3558
quadrupole: -2.2031 -18.6213 0.4256
quadrupole: 35.4548 0.1314 -35.5861 -2.2031 -18.6213 0.4256
hfenergy: -1033.4811096 hartree
pointgroup: C01 [X(C24H16N2)]
dipole: 0.2778575 -0.0141351 0.0092357 debye
polarizability: 702.5087873|22.4833423|277.5876177|0.0187299|0.0982612|136.9884024 unknown
InChI: InChI=1/C24H16N2/c25-16-3-7-18-13(9-16)1-5-20-22(18)11-15-12-23-19-8-4-17(26)10-14(19)2-6-21(23)24(15)20/h1-12H,25-26H2
charge 0 multiplicity 1
42 atoms
H  -4.02170848 -2.52840023 -0.0101889
C  -4.44916087 -1.5316523 -0.00711793
C  -5.80363965 -1.38181339 -0.01203159
H  -6.44970353 -2.25433125 -0.02952124
C  -6.3994829 -0.08565658 -0.00442959
C  -5.58843701 1.02191803 -0.00137621
H  -6.02790411 2.01575081 -0.00022918
C  -4.1739484 0.90240495 -0.00616687
C  -3.58360544 -0.40123548 -0.00531628
C  -2.1807607 -0.49265046 -0.00357058
C  -1.30377756 -1.69199653 -0.00213597
H  -1.65690531 -2.71572072 -0.00319941
C  -0.01792771 -1.27352209 0.00017308
C  1.36209193 -1.76130306 0.00244599
H  1.66890952 -2.79746313 0.00310018
C  2.16302814 -0.66339719 0.00402483
C  3.6120788 -0.52567386 0.00618549
C  4.48504955 -1.61604265 0.00769913
H  4.07927248 -2.62225453 0.00890163
C  5.85812093 -1.44472114 0.00740696
H  6.51404974 -2.3095637 0.01596692
C  6.41264717 -0.1574478 0.0030519
C  5.5500871 0.93940975 0.00438793
H  5.96481561 1.94396595 0.01061497
C  4.1652826 0.77352286 0.00547349
C  3.29455627 1.94973329 0.00508976
H  3.77786575 2.92211701 0.0066397
C  1.94962543 1.86757283 0.00347209
H  1.34047586 2.76453435 0.00355988
C  1.31429531 0.57495501 0.00252889
C  0.01355545 0.18621737 0.0002295
C  -1.37772696 0.65376207 -0.00229189
C  -1.95931848 1.92592349 -0.00299274
H  -1.34064642 2.81654714 -0.00233471
C  -3.33554564 2.0412257 -0.00511406
H  -3.79555959 3.02416999 -0.00620897
N  -7.79189778 0.00917111 -0.06435978
H  -8.16767694 0.90258947 0.21865659
H  -8.28855606 -0.75323958 0.37346617
N  7.79378845 0.02022745 0.05716337
H  8.34098586 -0.75056326 -0.29637328
H  8.12854962 0.9067938 -0.28992618
