program: Orca
programVersion: 6.0.1
elementType: C C C S F F F F F F O O O F
charge: -1
multiplicity: 1
keywords: B3LYP D3BJ TightOpt Freq def2-TZVPP def2/J RIJCOSX VeryTightSCF defgrid3 KeepDens CHELPG
frequency: 0.00 0.00 0.00 0.00 0.00 0.00 49.83 59.73 94.13 122.95 156.98 197.82 221.52 246.99 257.00 292.59 297.61 323.80 345.88 363.66 407.84 472.46 519.19 536.87 546.48 579.12 620.34 636.57 647.98 747.04 922.41 1018.64 1049.24 1098.96 1132.67 1152.22 1162.79 1228.06 1241.19 1288.87 1295.87 1328.90
frequency: 49.83 59.73 94.13 122.95 156.98 197.82 221.52 246.99 257.00 292.59 297.61 323.80 345.88 363.66 407.84 472.46 519.19 536.87 546.48 579.12 620.34 636.57 647.98 747.04 922.41 1018.64 1049.24 1098.96 1132.67 1152.22 1162.79 1228.06 1241.19 1288.87 1295.87 1328.90
formula: C3F7O3S
InChI: InChI=1/C3F7O3S/c4-1(5,2(6,7)8)3(9,10)14(11,12)13
14 atoms
C  -1.701665 2.405198 4.245404
C  -0.155424 2.498497 4.400331
C  0.426295 3.362257 5.558236
S  -0.126326 5.15086 5.704251
F  -2.228637 3.520658 3.763962
F  -2.293774 2.084347 5.39699
F  0.277327 1.214724 4.5912
F  0.336396 2.914199 3.215983
F  1.777091 3.310603 5.384652
F  0.148702 2.704291 6.717249
O  0.082704 5.660822 4.361025
O  0.774465 5.658933 6.720417
O  -1.513526 5.006418 6.110901
F  -1.975642 1.415073 3.360472
totalener: -1437.01449723112273 hartree
nucrepener: 1333.35836394880084 hartree
electener: -2770.37285588302939 hartree
oneelecener: -4665.78192293673328 hartree
twoeener: 1895.40906705370389 hartree
kineticenergy: 1432.23301679101746 hartree
exchangeener: -108.177749438618 hartree
correlationener: -5.442191669795 hartree
xcener: -113.619941108414 hartree
dispersion: -0.027374402 hartree
dispersion: -0.025714249 hartree
dispersion: -0.025786238 hartree
dispersion: -0.025908267 hartree
dispersion: -0.026075947 hartree
dispersion: -0.026099758 hartree
dispersion: -0.026116230 hartree
dispersion: -0.026213056 hartree
dispersion: -0.026149392 hartree
dispersion: -0.026179008 hartree
dispersion: -0.026219285 hartree
dispersion: -0.026230308 hartree
dispersion: -0.026235091 hartree
dispersion: -0.026234925 hartree
energy: -2418.5980 -669.8264 -669.8039 -669.7424 -669.4600 -669.4489 -668.7605 -668.7461 -515.4900 -515.4814 -515.4794 -281.0740 -279.2277 -278.2847 -215.6302 -160.2596 -160.1650 -160.1634 -33.2535 -31.9405 -31.0353 -30.8556 -30.6839 -30.2215 -29.4904 -26.2262 -22.5652 -22.5540 -18.7291 -16.6818 -15.1588 -13.9356 -13.7179 -13.6625 -12.9286 -12.5549 -12.2066 -11.7401 -10.3307 -10.3091 -10.1965 -10.0318 -9.5515 -9.3895 -9.1629 -8.9149 -8.6642 -8.5891 -8.4952 -8.3962 -8.0476 -7.9785 -7.9557 -7.8192 -6.7115 -5.1677 -5.1564 -4.2962 -4.2875 -3.9520 -2.9208 4.3989 4.5475 6.0526 6.4260 6.7922 6.8138 7.1745 7.8564 8.4540 8.7203 8.9465 electronvolt
chargesum: -1.0000000
charge: 0.448946 0.306108 0.246793 0.815761 -0.137918 -0.162191 -0.199179 -0.172176 -0.197035 -0.200134 -0.518962 -0.519996 -0.518214 -0.191805
charge: -0.667062 -0.477612 -0.582778 0.410855 0.243335 0.220406 0.173581 0.211629 0.162862 0.162798 -0.346039 -0.340193 -0.345156 0.173372
qa: 0.4489 0.3061 0.2468 0.8158 -0.1379 -0.1622 -0.1992 -0.1722 -0.1970 -0.2001 -0.5190 -0.5200 -0.5182 -0.1918
va: 4.4985 4.1588 4.0483 6.2095 1.1828 1.1503 1.0971 1.1352 1.0905 1.0823 1.9118 1.9519 1.9075 1.1068
dispersion: -0.026234901 hartree
energy: -1437.202868108966 hartree
dipole: 0.883642416 -1.412826476 -0.529184060 6.314290422 -8.772119901 -2.457829480 2.373982053 -3.403869174 -1.029887121
dipolemethod: SCF
magnitude: 2.716915347 au
magnitude: 6.905849995 debye
temp: 298.15 k
press: 1.00 atm
zeropoint: 0.05163279 hartree
thermalvibcorrection: 0.00983784 hartree
thermalrotcorrection: 0.00141627 hartree
thermaltrasncorrection: 0.00141627 hartree
thermaltotal: -1437.13856493 hartree
thermalcorr: 0.01267039 hartree
nonthermalcorr: 0.05163279 hartree
totalcorr: 0.06430318 hartree
thermalcorrenthalpy: 0.00094421 hartree
totalenthalpy: -1437.13762072 hartree
vibrat: 0.01702793 hartree
rotat: 0.01493726 hartree
transl: 0.02016371 hartree
total: 0.05212890 hartree
totalentropycorr: -0.05212890 hartree
gibbsenthalpy: -1437.18974962 hartree
gibbsminuselec: 0.01311848 hartree
