program: Orca
programVersion: 6.0.1
elementType: C C C S F F F F F F O O O F
charge: -1
multiplicity: 1
keywords: B3LYP D3BJ TightOpt Freq def2-TZVPP def2/J RIJCOSX VeryTightSCF defgrid3 KeepDens CHELPG
frequency: 0.00 0.00 0.00 0.00 0.00 0.00 10.77 12.09 39.77 50.06 57.53 64.17 84.40 141.04 172.41 248.08 262.75 362.27 370.96 381.14 387.19 461.91 510.18 522.53 566.44 567.52 570.76 598.52 653.27 661.64 676.44 762.07 1015.72 1061.93 1095.49 1199.08 1207.90 1295.66 1310.25 1327.43 1391.63 1835.28
frequency: 10.77 12.09 39.77 50.06 57.53 64.17 84.40 141.04 172.41 248.08 262.75 362.27 370.96 381.14 387.19 461.91 510.18 522.53 566.44 567.52 570.76 598.52 653.27 661.64 676.44 762.07 1015.72 1061.93 1095.49 1199.08 1207.90 1295.66 1310.25 1327.43 1391.63 1835.28
formula: C3F7O3S
InChI: InChI=1/C3F6.FO3S/c4-1(2(5)6)3(7,8)9;1-5(2,3)4
14 atoms
C  -1.522331 2.681355 3.763819
C  -0.091104 2.410689 4.089513
C  0.507334 2.487738 5.26984
S  0.72661 6.163845 5.455308
F  -1.656248 3.563332 2.76694
F  -2.224329 3.096513 4.815679
F  1.764584 2.146146 5.436463
F  0.622367 2.000294 3.020865
F  1.892402 4.979623 5.510154
F  -0.059359 2.847744 6.386629
O  -0.299109 5.514207 4.6634
O  1.427778 7.249006 4.809526
O  0.417871 6.343681 6.855518
F  -2.111698 1.525986 3.319383
totalener: -1437.16641935848634 hartree
nucrepener: 1222.29788863855424 hartree
electener: -2659.46430176825925 hartree
oneelecener: -4444.10425731802752 hartree
twoeener: 1784.63995554976827 hartree
kineticenergy: 1433.03716599793552 hartree
exchangeener: -108.410353128658 hartree
correlationener: -5.442074087839 hartree
xcener: -113.852427216497 hartree
dispersion: -0.021841803 hartree
dispersion: -0.021840296 hartree
dispersion: -0.021836036 hartree
dispersion: -0.021834229 hartree
dispersion: -0.021830549 hartree
dispersion: -0.021829315 hartree
dispersion: -0.021829649 hartree
dispersion: -0.021830886 hartree
dispersion: -0.021832731 hartree
dispersion: -0.021834626 hartree
dispersion: -0.021836296 hartree
dispersion: -0.021837586 hartree
dispersion: -0.021838446 hartree
dispersion: -0.021838657 hartree
dispersion: -0.021838260 hartree
dispersion: -0.021837838 hartree
dispersion: -0.021838220 hartree
dispersion: -0.021839719 hartree
dispersion: -0.021842221 hartree
dispersion: -0.021845788 hartree
dispersion: -0.021851548 hartree
dispersion: -0.021858958 hartree
dispersion: -0.021866414 hartree
dispersion: -0.021870851 hartree
energy: -2419.0579 -670.3137 -670.2891 -669.9176 -669.7664 -669.7363 -669.7230 -666.9324 -515.3885 -515.3528 -515.3424 -281.2446 -279.2186 -276.9445 -216.0052 -160.7102 -160.5131 -160.5078 -33.1638 -32.8629 -31.3702 -31.1101 -30.8227 -30.5572 -28.4807 -25.4492 -22.5195 -22.5066 -19.6702 -17.1091 -15.1836 -14.1664 -13.8979 -13.5556 -13.2690 -12.5395 -12.1925 -11.9398 -10.5171 -10.2264 -10.0709 -9.9794 -9.8846 -9.8372 -9.5283 -9.4538 -9.0325 -8.9734 -8.5601 -8.4197 -8.3988 -8.0026 -7.0012 -6.9403 -5.5028 -5.0822 -5.0552 -4.6054 -3.8026 -3.7793 -2.8102 2.7121 3.7422 5.0002 6.1418 6.5356 6.9937 7.1502 7.2605 7.6635 8.7939 8.9196 electronvolt
chargesum: -1.0000000
charge: 0.518909 0.064666 0.400666 0.956644 -0.159426 -0.157556 -0.156753 -0.208430 -0.333578 -0.131410 -0.540723 -0.523437 -0.523334 -0.206236
charge: -0.653701 -0.282647 -0.446999 0.351267 0.217184 0.231113 0.250997 0.192874 -0.202256 0.278411 -0.360139 -0.360154 -0.363118 0.147168
qa: 0.5189 0.0647 0.4007 0.9566 -0.1594 -0.1576 -0.1568 -0.2084 -0.3336 -0.1314 -0.5407 -0.5234 -0.5233 -0.2062
va: 4.4819 3.7993 4.1633 6.3286 1.1497 1.1555 1.1711 1.0794 0.9003 1.2045 1.8682 1.9429 1.9029 1.0749
dispersion: -0.021872703 hartree
energy: -1437.188286363814 hartree
dipole: 1.672050251 -2.573445817 -0.901395566 6.814129357 -10.293058217 -3.478928860 1.973348825 -2.668405647 -0.695056822
dipolemethod: SCF
magnitude: 3.660404891 au
magnitude: 9.304009831 debye
temp: 298.15 k
press: 1.00 atm
zeropoint: 0.04997460 hartree
thermalvibcorrection: 0.01148902 hartree
thermalrotcorrection: 0.00141627 hartree
thermaltrasncorrection: 0.00141627 hartree
thermaltotal: -1437.12399020 hartree
thermalcorr: 0.01432157 hartree
nonthermalcorr: 0.04997460 hartree
totalcorr: 0.06429617 hartree
thermalcorrenthalpy: 0.00094421 hartree
totalenthalpy: -1437.12304599 hartree
vibrat: 0.02192553 hartree
rotat: 0.01529963 hartree
transl: 0.02016371 hartree
total: 0.05738887 hartree
totalentropycorr: -0.05738887 hartree
gibbsenthalpy: -1437.18043486 hartree
gibbsminuselec: 0.00785150 hartree
