program: Orca
programVersion: 6.0.1
elementType: C F C F F F F S O O O C C F F C F F F F
charge: -1
multiplicity: 1
keywords: B3LYP D3BJ def2-TZVP VeryTightSCF IRC defgrid3 KeepDens CHELPG
keywords: PAL8
formula: C5F11O3S
InChI: InChI=1/C5F10.F.O3S/c6-1(2(7)8)3(9,10)4(11,12)5(13,14)15;;1-4(2)3
20 atoms
C  0.971647 -0.178134 0.419651
F  -1.323199 -0.551803 -0.132559
C  1.142635 -0.959892 1.524818
F  0.209597 1.374815 0.835061
F  2.094168 0.36252 -0.109781
F  0.325495 -1.986844 1.817144
F  2.342836 -1.106353 2.105847
S  -0.123432 0.897009 3.368605
O  -1.416093 0.363167 3.048776
O  0.775158 0.097134 4.164015
O  0.066537 2.31801 3.40909
C  -0.069461 -0.557494 -0.624943
C  -0.037358 0.27918 -1.953451
F  1.052804 -0.094358 -2.672644
F  0.023849 1.600702 -1.755741
C  -1.27722 0.041141 -2.876169
F  -1.048248 0.630208 -4.064864
F  -2.38327 0.580984 -2.36251
F  -1.500871 -1.257596 -3.103992
F  0.174429 -1.852397 -1.036353
totalener: -1912.65505389521081 hartree
nucrepener: 2199.50805968744726 hartree
electener: -4112.16311624756418 hartree
oneelecener: -7059.58078263170501 hartree
twoeener: 2947.41766638414038 hartree
kineticenergy: 1906.96006742651844 hartree
exchangeener: -148.662879754094 hartree
correlationener: -7.562689898079 hartree
xcener: -156.225569652172 hartree
energy: -2420.2321 -670.5100 -670.4654 -670.4537 -669.9273 -669.8137 -669.3868 -669.2703 -668.8478 -668.7915 -668.7627 -664.9673 -517.6457 -517.6399 -517.5723 -281.6856 -279.8140 -279.3279 -277.3442 -276.9345 -217.3704 -162.0572 -161.8617 -161.8539 -33.9162 -32.4235 -31.7713 -31.4978 -31.3750 -30.9821 -30.7434 -30.3681 -30.0589 -29.5191 -28.0775 -25.1615 -24.6100 -24.5057 -19.4067 -18.5296 -17.0363 -15.7389 -14.4572 -14.3514 -14.2549 -13.8480 -13.2724 -13.1706 -12.6459 -12.5560 -12.3295 -12.0357 -11.3994 -10.9151 -10.8709 -10.8446 -10.7071 -10.1793 -10.0447 -9.9941 -9.8009 -9.7581 -9.7428 -9.6273 -9.3862 -9.3378 -9.2712 -9.0451 -8.9030 -8.7631 -8.4700 -8.4104 -8.3597 -7.9981 -7.8154 -6.9701 -6.8954 -6.6802 -6.3305 -6.1598 -6.0421 -5.0034 -4.9650 -4.7483 -1.8625 0.9386 3.5033 3.7668 4.0529 4.5691 5.3915 5.5992 6.2769 6.7719 7.0962 7.4233 electronvolt
chargesum: -1.0000000
charge: 0.288500 -0.171634 0.134193 -0.483591 -0.200028 -0.204084 -0.203950 0.941022 -0.382547 -0.401536 -0.386097 0.340916 0.321470 -0.188351 -0.144896 0.448855 -0.175546 -0.154974 -0.165384 -0.212337
charge: -0.384188 0.220716 -0.512753 -0.299390 0.192302 0.172926 0.174975 0.566149 -0.259221 -0.270051 -0.263447 -0.436818 -0.462745 0.192949 0.238689 -0.657400 0.194116 0.220673 0.211686 0.160832
qa: 0.2885 -0.1716 0.1342 -0.4836 -0.2000 -0.2041 -0.2039 0.9410 -0.3825 -0.4015 -0.3861 0.3409 0.3215 -0.1884 -0.1449 0.4489 -0.1755 -0.1550 -0.1654 -0.2123
va: 3.9312 1.1341 4.0175 0.7643 1.0766 1.0742 1.0782 5.8440 2.0184 2.0052 2.0417 4.0635 4.1649 1.1135 1.1767 4.5399 1.1301 1.1575 1.1454 1.0832
dispersion: -0.036521076 hartree
energy: -1912.691574971528 hartree
dipole: -0.120410972 -0.346390503 -0.466801476 2.525028352 -3.317100453 -0.792072101 10.839010258 -13.239321255 -2.400310997
dipolemethod: SCF
magnitude: 2.570364704 au
magnitude: 6.533347864 debye
temp: 298.15 k
press: 1.00 atm
zeropoint: 0.07092759 hartree
thermalvibcorrection: 0.01705343 hartree
thermalrotcorrection: 0.00141627 hartree
thermaltrasncorrection: 0.00141627 hartree
thermaltotal: -1912.60076140 hartree
thermalcorr: 0.01988597 hartree
nonthermalcorr: 0.07092759 hartree
totalcorr: 0.09081357 hartree
thermalcorrenthalpy: 0.00094421 hartree
totalenthalpy: -1912.59981719 hartree
vibrat: 0.03155681 hartree
rotat: 0.01613292 hartree
transl: 0.02064181 hartree
total: 0.06833154 hartree
totalentropycorr: -0.06833154 hartree
gibbsenthalpy: -1912.66814873 hartree
gibbsminuselec: 0.02342624 hartree
