program: Orca
programVersion: 6.0.1
elementType: C C F F C C F C F F F F F F F F S O O O
charge: -1
multiplicity: 1
keywords: B3LYP D3BJ TightOpt Freq def2-TZVPP def2/J RIJCOSX VeryTightSCF defgrid3 KeepDens CHELPG
frequency: 0.00 0.00 0.00 0.00 0.00 0.00 41.62 58.43 63.59 70.98 88.23 98.25 140.61 162.47 178.49 195.79 216.65 235.71 246.31 256.31 270.71 289.46 298.50 308.11 319.86 326.44 346.82 376.49 394.28 474.87 509.27 524.46 528.70 543.08 546.00 574.09 593.26 618.90 622.47 666.89 701.77 743.93 816.98 904.98 995.69 1050.98 1067.56 1108.18 1129.99 1149.67 1166.45 1189.36 1197.59 1209.13 1225.18 1243.72 1276.86 1301.68 1304.91 1318.41
frequency: 41.62 58.43 63.59 70.98 88.23 98.25 140.61 162.47 178.49 195.79 216.65 235.71 246.31 256.31 270.71 289.46 298.50 308.11 319.86 326.44 346.82 376.49 394.28 474.87 509.27 524.46 528.70 543.08 546.00 574.09 593.26 618.90 622.47 666.89 701.77 743.93 816.98 904.98 995.69 1050.98 1067.56 1108.18 1129.99 1149.67 1166.45 1189.36 1197.59 1209.13 1225.18 1243.72 1276.86 1301.68 1304.91 1318.41
formula: C5F11O3S
InChI: InChI=1/C5F11O3S/c6-1(7,2(8,9)4(11,12)13)3(10,5(14,15)16)20(17,18)19
20 atoms
C  1.591372 0.680054 -0.393955
C  0.715772 -0.419318 0.299094
F  1.662891 1.781574 0.376848
F  1.101643 0.99066 -1.600042
C  3.077437 0.234775 -0.63522
C  -0.651967 -0.001797 0.908682
F  -0.608615 -2.154245 2.033967
C  -1.423799 -1.255348 1.419624
F  -0.362801 0.744194 2.031302
F  1.515859 -0.902505 1.303716
F  0.535148 -1.421912 -0.588141
F  3.784586 0.182851 0.497834
F  3.668206 1.138161 -1.435261
F  3.153375 -0.957669 -1.237484
F  -2.332242 -0.901622 2.331986
F  -2.038758 -1.910907 0.433222
S  -1.770555 1.046785 -0.249671
O  -1.723425 0.298745 -1.490785
O  -1.076761 2.318939 -0.250962
O  -3.041109 1.032406 0.445699
totalener: -1912.77383004047647 hartree
nucrepener: 2319.47718087540170 hartree
electener: -4232.25100075882256 hartree
oneelecener: -7298.83699799246187 hartree
twoeener: 3066.58599723363932 hartree
kineticenergy: 1907.05251513475969 hartree
exchangeener: -148.750491847376 hartree
correlationener: -7.579467208255 hartree
xcener: -156.329959055631 hartree
dispersion: -0.041137168 hartree
energy: -2418.8978 -670.5195 -670.4795 -670.4543 -669.8187 -669.7571 -669.7064 -669.6072 -669.4765 -669.4506 -669.4331 -668.8450 -515.7545 -515.7467 -515.7358 -281.6829 -280.7882 -279.8219 -279.5723 -277.1266 -215.9274 -160.5687 -160.4560 -160.4548 -33.9247 -32.8772 -32.4252 -32.0106 -31.5081 -31.3874 -30.7773 -30.5606 -30.4220 -30.3139 -30.1741 -26.5264 -22.8567 -22.8498 -19.4695 -18.7080 -17.1561 -15.9600 -15.1649 -14.3724 -14.3582 -14.2997 -13.6307 -13.4339 -13.3504 -13.1362 -12.7718 -12.5926 -12.4142 -11.7057 -10.9309 -10.8977 -10.7010 -10.3161 -10.1895 -10.0983 -9.9267 -9.8663 -9.7482 -9.6207 -9.3388 -9.2881 -9.1901 -9.1005 -8.9824 -8.8296 -8.6754 -8.6189 -8.4213 -8.3174 -8.2478 -8.1937 -8.0730 -7.5794 -6.4180 -5.4427 -5.3954 -4.5625 -4.5027 -4.2288 -3.1823 3.5933 3.8289 4.8002 5.3928 5.6171 6.0062 6.2161 6.8167 6.8661 6.9256 7.6768 electronvolt
chargesum: -1.0000000
charge: 0.336600 0.276378 -0.166635 -0.150408 0.457434 0.112095 -0.195448 0.442749 -0.218633 -0.202258 -0.180485 -0.164179 -0.170109 -0.165581 -0.160568 -0.160375 0.828527 -0.503247 -0.506041 -0.509817
charge: -0.483015 -0.458922 0.224934 0.241928 -0.655162 -0.398979 0.166002 -0.674272 0.156681 0.178822 0.215333 0.209340 0.200402 0.210780 0.216148 0.218012 0.426087 -0.334677 -0.329509 -0.329935
qa: 0.3366 0.2764 -0.1666 -0.1504 0.4574 0.1121 -0.1954 0.4427 -0.2186 -0.2023 -0.1805 -0.1642 -0.1701 -0.1656 -0.1606 -0.1604 0.8285 -0.5032 -0.5060 -0.5098
va: 4.1731 4.1075 1.1508 1.1709 4.5604 3.7253 1.0924 4.5962 1.0618 1.0975 1.1335 1.1443 1.1372 1.1439 1.1494 1.1525 6.2152 1.9223 1.9481 1.9631
dispersion: -0.041137492 hartree
energy: -1912.814967210006 hartree
dipole: -7.012392566 9.808527761 2.796135195 3.709186449 -4.999171059 -1.289984610 -1.836156425 2.291369233 0.455212808
dipolemethod: SCF
magnitude: 3.112820429 au
magnitude: 7.912160741 debye
temp: 298.15 k
press: 1.00 atm
zeropoint: 0.07583825 hartree
thermalvibcorrection: 0.01540220 hartree
thermalrotcorrection: 0.00141627 hartree
thermaltrasncorrection: 0.00141627 hartree
thermaltotal: -1912.72089422 hartree
thermalcorr: 0.01823474 hartree
nonthermalcorr: 0.07583825 hartree
totalcorr: 0.09407299 hartree
thermalcorrenthalpy: 0.00094421 hartree
totalenthalpy: -1912.71995001 hartree
vibrat: 0.02695635 hartree
rotat: 0.01593545 hartree
transl: 0.02064181 hartree
total: 0.06353361 hartree
totalentropycorr: -0.06353361 hartree
gibbsenthalpy: -1912.78348362 hartree
gibbsminuselec: 0.03148359 hartree
