program: Orca
programVersion: 6.0.1
elementType: C C F F C C F C F F F F F F F F S O O O
charge: -1
multiplicity: 1
keywords: DLPNO-CCSD(T) def2-TZVPP def2-TZVPP/C VeryTightSCF TightPNO KeepDens CHELPG
formula: C5F11O3S
InChI: InChI=1/C5F11.O3S/c6-1(3(9,10)11)2(7,8)4(12,13)5(14,15)16;1-4(2)3
20 atoms
C  2.059896 0.589637 0.665626
C  0.909547 -0.450128 0.51531
F  2.262027 0.822579 1.992184
F  1.744927 1.764319 0.079072
C  3.461069 0.180335 0.112896
C  -0.312997 -0.191395 1.172986
F  -0.370747 -0.905876 3.480042
C  -0.915182 -1.030291 2.198031
F  -0.575599 1.158854 1.39141
F  1.411336 -1.694389 0.72696
F  0.761221 -0.433458 -1.006844
F  3.971924 -0.861429 0.781307
F  4.311048 1.216785 0.278258
F  3.441443 -0.117722 -1.185507
F  -2.228462 -0.723712 2.393913
F  -0.841735 -2.349037 1.923416
S  -1.675193 -0.664499 -1.715074
O  -1.993797 -1.917725 -1.105356
O  -1.077883 -0.665978 -3.017178
O  -2.242608 0.551243 -1.223212
totalener: -1905.87438408365051 hartree
nucrepener: 2200.82052057699821 hartree
electener: -4106.69490466064872 hartree
oneelecener: -7060.35958438326179 hartree
twoeener: 2953.66467972261307 hartree
kineticenergy: 1904.11812337747415 hartree
energy: -2506.8674 -714.3302 -714.3161 -714.2816 -713.6774 -713.6431 -713.2316 -712.7062 -712.4458 -712.0459 -711.6691 -711.3635 -557.9651 -557.9520 -557.8624 -310.9232 -309.1301 -308.7952 -307.9715 -302.6149 -247.4868 -184.5806 -184.4555 -184.4545 -44.7512 -43.0248 -42.5833 -42.1722 -42.0555 -41.8461 -41.2957 -40.3139 -39.6694 -39.4297 -39.2120 -38.8342 -35.0561 -34.9483 -26.8439 -25.4690 -23.5736 -22.1920 -20.5534 -20.2066 -20.1549 -19.8650 -19.7101 -18.7061 -18.5212 -18.2901 -17.9487 -17.9097 -17.0178 -16.9538 -16.8488 -16.8095 -16.4321 -16.3805 -16.3153 -16.3100 -16.0627 -15.6344 -15.6016 -15.4942 -15.2868 -15.2195 -15.0154 -14.8784 -14.3496 -14.2364 -14.1539 -13.8054 -13.5944 -13.4816 -13.4419 -13.3516 -13.2963 -12.9377 -12.8659 -12.3333 -11.5896 -11.5002 -11.0492 -10.6661 -4.9538 5.1367 6.9478 8.6306 8.9001 9.2018 10.2953 10.5539 10.7935 11.1030 11.6142 11.7842 electronvolt
chargesum: -1.0000000
charge: 0.520971 0.546490 -0.254621 -0.242991 0.628221 -0.255245 -0.304740 0.662412 -0.336530 -0.259008 -0.405683 -0.235415 -0.247100 -0.225116 -0.272861 -0.261702 1.379836 -0.471485 -0.502145 -0.463289
charge: -0.347506 -0.337692 0.146469 0.161913 -0.518516 -0.375794 0.040948 -0.520211 0.048097 0.150013 -0.099548 0.160942 0.139975 0.175311 0.108909 0.134753 0.775939 -0.275472 -0.300023 -0.268507
qa: 0.5210 0.5465 -0.2546 -0.2430 0.6282 -0.2552 -0.3047 0.6624 -0.3365 -0.2590 -0.4057 -0.2354 -0.2471 -0.2251 -0.2729 -0.2617 1.3798 -0.4715 -0.5021 -0.4633
va: 4.0332 3.9331 1.0185 1.0281 4.2841 3.1652 0.9172 4.3056 0.8466 0.9854 0.7820 1.0356 1.0129 1.0523 0.9657 0.9763 5.7011 1.9476 1.9364 1.9546
e0: -1905.874384084 hartree
corrType: DLPNO BASED
energy: -1910.444598075970 hartree
dipole: -7.428788062 8.661018134 1.232230072 -1.104242645 1.147861214 0.043618569 -6.537724232 6.021894453 -0.515829778
dipolemethod: SCF
magnitude: 1.336552988 au
magnitude: 3.397247713 debye
