program: Orca
programVersion: 6.0.1
elementType: C C F F C C F C F F F F F F F F S O O O
charge: -1
multiplicity: 1
keywords: DLPNO-CCSD(T) def2-TZVPP def2-TZVPP/C VeryTightSCF TightPNO KeepDens CHELPG
formula: C5F11O3S
InChI: InChI=1/C5F10.FO3S/c6-1(2(7)4(10,11)12)3(8,9)5(13,14)15;1-5(2,3)4
20 atoms
C  1.134246 0.514318 -0.728916
C  0.597688 -0.566572 0.176564
F  1.422126 1.635103 0.01714
F  0.240122 0.891621 -1.659785
C  2.46478 0.155082 -1.456862
C  -0.542028 -0.457654 0.843643
F  -0.467839 -1.224542 3.066087
C  -1.06875 -1.448642 1.855718
F  -1.273305 0.651201 0.746324
F  1.389569 -1.630505 0.335491
F  -1.803803 -3.833267 -1.514446
F  3.448662 -0.03668 -0.559891
F  2.822659 1.194144 -2.23234
F  2.359796 -0.919977 -2.218457
F  -2.377434 -1.29455 2.051166
F  -0.815106 -2.712014 1.529578
S  -1.72908 -2.267565 -1.984813
O  -0.299418 -2.0462 -2.08493
O  -2.372585 -1.584773 -0.876846
O  -2.458326 -2.27275 -3.228302
totalener: -1905.98324054124259 hartree
nucrepener: 2203.35130401933293 hartree
electener: -4109.33454456057552 hartree
oneelecener: -7064.33643219319219 hartree
twoeener: 2955.00188763261667 hartree
kineticenergy: 1904.24860205184291 hartree
energy: -2504.9585 -714.6921 -714.6328 -714.5334 -714.1821 -714.1342 -714.1310 -714.1202 -714.1151 -714.1034 -714.0837 -711.5409 -554.7965 -554.7795 -554.7074 -311.3065 -311.0108 -309.5665 -306.7548 -306.6603 -245.3393 -182.4258 -182.3591 -182.3577 -45.0944 -44.5145 -43.4994 -42.6287 -42.5436 -42.4814 -42.3675 -41.9730 -41.7561 -41.7262 -39.9062 -35.5588 -32.1660 -32.1464 -28.2652 -26.7016 -24.7020 -23.0651 -21.6558 -20.7116 -20.5728 -20.4908 -19.9870 -19.8554 -19.8089 -19.1828 -18.9780 -18.8091 -18.2568 -17.4525 -17.3152 -17.2126 -17.1535 -16.9013 -16.7307 -16.6666 -16.3764 -16.3734 -16.1014 -15.9185 -15.9008 -15.6659 -15.5827 -15.4622 -15.3640 -15.2719 -15.1028 -14.9111 -14.8701 -14.6721 -13.7231 -13.1173 -13.0837 -12.2990 -10.6877 -10.5587 -10.2939 -8.9307 -8.8791 -8.2961 -7.9224 5.8743 7.8301 8.5768 9.1418 9.8877 10.1835 10.2430 11.3786 11.4601 11.5876 11.7414 electronvolt
chargesum: -1.0000000
charge: 0.557015 0.145983 -0.260663 -0.221368 0.634036 0.284406 -0.263800 0.680857 -0.246016 -0.248602 -0.369449 -0.242871 -0.238738 -0.196081 -0.221492 -0.216981 1.420005 -0.668518 -0.674272 -0.653450
charge: -0.348438 -0.195433 0.119622 0.183269 -0.524927 -0.188411 0.107117 -0.512822 0.189975 0.183385 -0.216142 0.152203 0.153354 0.208580 0.181679 0.190651 0.538832 -0.411030 -0.405476 -0.405986
qa: 0.5570 0.1460 -0.2607 -0.2214 0.6340 0.2844 -0.2638 0.6809 -0.2460 -0.2486 -0.3694 -0.2429 -0.2387 -0.1961 -0.2215 -0.2170 1.4200 -0.6685 -0.6743 -0.6535
va: 4.0879 3.9782 0.9913 1.0527 4.2837 3.9377 0.9826 4.2771 1.0111 0.9928 0.8413 1.0273 1.0280 1.0911 1.0524 1.0586 6.0273 1.7211 1.7179 1.8192
e0: -1905.983240541 hartree
corrType: DLPNO BASED
energy: -1910.529926188907 hartree
dipole: -4.972367158 7.421511546 2.449144388 -2.812659549 4.494916595 1.682257046 -4.370770705 6.490665522 2.119894817
dipolemethod: SCF
magnitude: 3.649965895 au
magnitude: 9.277476012 debye
