program: Orca
programVersion: 6.0.1
elementType: C C F F C C F C F F F F F F F F S O O O
charge: -1
multiplicity: 1
keywords: B3LYP D3BJ def2-TZVP VeryTightSCF IRC defgrid3 KeepDens CHELPG
keywords: PAL8
formula: C5F11O3S
InChI: InChI=1/C5F11.O3S/c6-1(3(9,10)11)2(7,8)4(12,13)5(14,15)16;1-4(2)3
20 atoms
C  2.059896 0.589637 0.665626
C  0.909547 -0.450128 0.51531
F  2.262027 0.822579 1.992184
F  1.744927 1.764319 0.079072
C  3.461069 0.180335 0.112896
C  -0.312997 -0.191395 1.172986
F  -0.370747 -0.905876 3.480042
C  -0.915182 -1.030291 2.198031
F  -0.575599 1.158854 1.39141
F  1.411336 -1.694389 0.72696
F  0.761221 -0.433458 -1.006844
F  3.971924 -0.861429 0.781307
F  4.311048 1.216785 0.278258
F  3.441443 -0.117722 -1.185507
F  -2.228462 -0.723712 2.393913
F  -0.841735 -2.349037 1.923416
S  -1.675193 -0.664499 -1.715074
O  -1.993797 -1.917725 -1.105356
O  -1.077883 -0.665978 -3.017178
O  -2.242608 0.551243 -1.223212
totalener: -1912.70074103125648 hartree
nucrepener: 2200.82052057699821 hartree
electener: -4113.52125765389883 hartree
oneelecener: -7062.47579087494887 hartree
twoeener: 2948.95453322105004 hartree
kineticenergy: 1907.00949062487393 hartree
exchangeener: -148.679966271130 hartree
correlationener: -7.562611801883 hartree
xcener: -156.242578073013 hartree
energy: -2420.9124 -670.1083 -670.0931 -670.0704 -669.4763 -669.4470 -668.9750 -668.6763 -668.4538 -668.0943 -667.6840 -667.5616 -518.3947 -518.3936 -518.3346 -281.2875 -279.6709 -279.2764 -278.1960 -274.3326 -218.0736 -162.7741 -162.5533 -162.5501 -33.5142 -31.8935 -31.5811 -31.1124 -30.9972 -30.7117 -30.2682 -29.4657 -28.9016 -28.8696 -28.8336 -28.1138 -25.4048 -25.3125 -18.9571 -17.9513 -16.4764 -15.4085 -14.1506 -13.9585 -13.8170 -13.5959 -13.1788 -12.6461 -12.5406 -12.2879 -11.9863 -11.9616 -11.2043 -10.7766 -10.6033 -10.5004 -10.4627 -10.4516 -10.4341 -10.2694 -9.6839 -9.4254 -9.2965 -9.1544 -8.9499 -8.8690 -8.8433 -8.5958 -8.4047 -8.1929 -8.1795 -7.9140 -7.7822 -7.6633 -7.6036 -7.5703 -7.5068 -7.2499 -7.2031 -7.0260 -6.7851 -6.7016 -6.0439 -5.4546 -1.8048 0.9790 2.7159 3.9101 4.2862 5.6232 5.7443 6.0692 6.6863 7.2812 7.4100 7.7936 electronvolt
chargesum: -1.0000000
charge: 0.349267 0.389240 -0.192349 -0.179070 0.450301 -0.218675 -0.236350 0.461283 -0.266344 -0.199886 -0.323526 -0.168894 -0.182496 -0.156420 -0.204686 -0.191686 0.969880 -0.359525 -0.385804 -0.354259
charge: -0.449863 -0.436761 0.191592 0.206492 -0.655010 -0.369150 0.089118 -0.648446 0.106098 0.192834 -0.033222 0.205198 0.183830 0.220303 0.155195 0.181636 0.577792 -0.233701 -0.255798 -0.228138
qa: 0.3493 0.3892 -0.1923 -0.1791 0.4503 -0.2187 -0.2364 0.4613 -0.2663 -0.1999 -0.3235 -0.1689 -0.1825 -0.1564 -0.2047 -0.1917 0.9699 -0.3595 -0.3858 -0.3543
va: 4.0649 3.8933 1.1148 1.1238 4.5462 3.2898 1.0273 4.5671 0.9778 1.0882 0.9365 1.1370 1.1188 1.1565 1.0783 1.0874 5.8379 2.0596 2.0516 2.0674
dispersion: -0.035628241 hartree
energy: -1912.736369271762 hartree
dipole: -7.428788062 8.696096597 1.267308535 -1.104242645 1.223030671 0.118788026 -6.537724232 6.316075803 -0.221648429
dipolemethod: SCF
magnitude: 1.292017625 au
magnitude: 3.284047816 debye
temp: 298.15 k
press: 1.00 atm
zeropoint: 0.07072312 hartree
thermalvibcorrection: 0.01691846 hartree
thermalrotcorrection: 0.00141627 hartree
thermaltrasncorrection: 0.00141627 hartree
thermaltotal: -1912.64589515 hartree
thermalcorr: 0.01975100 hartree
nonthermalcorr: 0.07072312 hartree
totalcorr: 0.09047412 hartree
thermalcorrenthalpy: 0.00094421 hartree
totalenthalpy: -1912.64495094 hartree
vibrat: 0.03163746 hartree
rotat: 0.01615710 hartree
transl: 0.02064181 hartree
total: 0.06843636 hartree
totalentropycorr: -0.06843636 hartree
gibbsenthalpy: -1912.71338730 hartree
gibbsminuselec: 0.02298197 hartree
