program: Orca
programVersion: 6.0.1
elementType: C C F F C C F C F F F F F F F F S O O O
charge: -1
multiplicity: 1
keywords: B3LYP D3BJ OptTS Freq def2-TZVPP def2/J RIJCOSX VeryTightSCF defgrid3 KeepDens CHELPG
frequency: 0.00 0.00 0.00 0.00 0.00 0.00 -473.13 -2.34 40.49 49.45 65.26 80.34 102.77 123.41 140.78 152.74 163.12 165.88 181.31 191.25 207.49 239.82 254.42 261.61 277.68 291.41 307.24 332.72 340.74 366.20 373.72 411.64 489.15 497.92 509.51 512.06 528.22 547.65 580.46 586.35 611.81 662.69 693.58 743.53 868.67 1011.38 1043.00 1089.00 1149.09 1171.64 1201.00 1210.61 1221.31 1247.41 1291.19 1299.52 1310.84 1333.38 1393.92 1737.05
frequency: 40.49 49.45 65.26 80.34 102.77 123.41 140.78 152.74 163.12 165.88 181.31 191.25 207.49 239.82 254.42 261.61 277.68 291.41 307.24 332.72 340.74 366.20 373.72 411.64 489.15 497.92 509.51 512.06 528.22 547.65 580.46 586.35 611.81 662.69 693.58 743.53 868.67 1011.38 1043.00 1089.00 1149.09 1171.64 1201.00 1210.61 1221.31 1247.41 1291.19 1299.52 1310.84 1333.38 1393.92 1737.05
formula: C5F11O3S
InChI: InChI=1/C5F10.F.O3S/c6-1(2(7)8)3(9,10)4(11,12)5(13,14)15;;1-4(2)3
20 atoms
C  1.803825 0.443339 0.109161
C  0.390679 -0.17289 -0.203017
F  2.182305 0.147363 1.357816
F  1.808757 1.770017 -0.097516
C  2.93224 -0.130743 -0.820663
C  -0.818474 0.586076 0.29348
F  -2.594403 1.004561 1.723703
C  -1.609627 0.249055 1.339868
F  0.074698 1.637467 1.998165
F  0.387292 -1.432605 0.280923
F  0.312681 -0.232248 -1.563587
F  2.914199 -1.468808 -0.859982
F  4.125668 0.249716 -0.33274
F  2.846821 0.332029 -2.07123
F  -1.099459 1.670728 -0.399044
F  -1.390536 -0.755425 2.131249
S  -2.937171 -0.895511 -0.630253
O  -3.630299 -1.589174 0.436074
O  -2.132484 -1.700637 -1.520316
O  -3.566693 0.287701 -1.172079
totalener: -1912.64562052633710 hartree
nucrepener: 2217.63046612926701 hartree
electener: -4130.27608345027329 hartree
oneelecener: -7093.85087741431562 hartree
twoeener: 2963.57479396404278 hartree
kineticenergy: 1906.53816532580822 hartree
exchangeener: -148.574303296315 hartree
correlationener: -7.556288283868 hartree
xcener: -156.130591580182 hartree
dispersion: -0.038986158 hartree
dispersion: -0.039001719 hartree
dispersion: -0.039090456 hartree
dispersion: -0.039072486 hartree
dispersion: -0.039100764 hartree
dispersion: -0.039114586 hartree
dispersion: -0.039135332 hartree
dispersion: -0.039150407 hartree
dispersion: -0.039160715 hartree
dispersion: -0.039182156 hartree
dispersion: -0.039163232 hartree
dispersion: -0.039184463 hartree
dispersion: -0.039169901 hartree
dispersion: -0.039232968 hartree
dispersion: -0.039243773 hartree
dispersion: -0.039287170 hartree
dispersion: -0.039327018 hartree
dispersion: -0.039331784 hartree
dispersion: -0.039262205 hartree
dispersion: -0.039125801 hartree
dispersion: -0.038978299 hartree
dispersion: -0.038926508 hartree
dispersion: -0.039004332 hartree
dispersion: -0.039108824 hartree
dispersion: -0.039326691 hartree
dispersion: -0.039637330 hartree
dispersion: -0.039729953 hartree
dispersion: -0.039841609 hartree
dispersion: -0.040000565 hartree
dispersion: -0.040127496 hartree
dispersion: -0.040178784 hartree
dispersion: -0.040265848 hartree
dispersion: -0.040384240 hartree
dispersion: -0.040305684 hartree
dispersion: -0.040222030 hartree
dispersion: -0.040000271 hartree
dispersion: -0.040021571 hartree
dispersion: -0.040017749 hartree
dispersion: -0.039991469 hartree
dispersion: -0.039964773 hartree
dispersion: -0.039955283 hartree
dispersion: -0.039943613 hartree
dispersion: -0.039942041 hartree
dispersion: -0.039933169 hartree
dispersion: -0.039937313 hartree
dispersion: -0.039938279 hartree
energy: -2420.0936 -670.5035 -670.4593 -670.4445 -670.3329 -670.2415 -669.8852 -669.8185 -669.7862 -669.7315 -669.7152 -663.2625 -517.5818 -517.5693 -517.5630 -281.6536 -279.8662 -279.8388 -279.6086 -277.8102 -217.2349 -161.8835 -161.7425 -161.7384 -33.9043 -32.9818 -32.4813 -32.0901 -31.5808 -31.4882 -31.3744 -31.2592 -30.7821 -30.5571 -27.9740 -24.4839 -24.4632 -23.2213 -19.8411 -19.0672 -17.4955 -16.1060 -15.1222 -14.4506 -14.3396 -14.2842 -13.8695 -13.8378 -13.4020 -13.1241 -12.9093 -12.7078 -12.4261 -12.1734 -10.9329 -10.8939 -10.6687 -10.5311 -10.3072 -10.1242 -10.0892 -9.9440 -9.8701 -9.8444 -9.7879 -9.6650 -9.6323 -9.5722 -9.4888 -9.2769 -9.1420 -8.9809 -8.7257 -8.6684 -8.1698 -6.9418 -6.9217 -6.8419 -6.1126 -6.0989 -5.2603 -4.7768 -3.6471 -3.5458 -2.6792 0.6227 2.3665 3.6155 4.3585 4.6477 5.0647 5.5062 6.2046 6.5070 6.9220 7.2968 electronvolt
chargesum: -1.0000000
charge: 0.370049 0.263876 -0.151654 -0.161463 0.448382 0.238294 -0.119171 0.358599 -0.653264 -0.183352 -0.184282 -0.166495 -0.171914 -0.163061 -0.148397 -0.123566 0.820110 -0.430070 -0.420715 -0.421905
charge: -0.479393 -0.454187 0.236000 0.230140 -0.656269 -0.312707 0.292156 -0.513577 -0.554644 0.219556 0.200946 0.209669 0.198022 0.210417 0.274224 0.291632 0.484575 -0.296212 -0.289562 -0.290785
qa: 0.3700 0.2639 -0.1517 -0.1615 0.4484 0.2383 -0.1192 0.3586 -0.6533 -0.1834 -0.1843 -0.1665 -0.1719 -0.1631 -0.1484 -0.1236 0.8201 -0.4301 -0.4207 -0.4219
va: 4.1652 4.2196 1.1607 1.1554 4.5561 3.8123 1.2207 4.4554 0.6075 1.1255 1.1201 1.1428 1.1342 1.1458 1.1642 1.2098 5.8725 1.9715 1.9920 1.9804
dispersion: -0.039943687 hartree
energy: -1912.701564194343 hartree
dipole: -9.770466712 11.524065694 1.753598982 -3.003621021 2.337392305 -0.666228715 -2.212755511 1.321518052 -0.891237459
dipolemethod: SCF
magnitude: 2.076842387 au
magnitude: 5.278913825 debye
temp: 298.15 k
press: 1.00 atm
zeropoint: 0.07213460 hartree
thermalvibcorrection: 0.01583551 hartree
thermalrotcorrection: 0.00141627 hartree
thermaltrasncorrection: 0.00141627 hartree
thermaltotal: -1912.61076154 hartree
thermalcorr: 0.01866806 hartree
nonthermalcorr: 0.07213460 hartree
totalcorr: 0.09080266 hartree
thermalcorrenthalpy: 0.00094421 hartree
totalenthalpy: -1912.60981733 hartree
vibrat: 0.02807581 hartree
rotat: 0.01605415 hartree
transl: 0.02064181 hartree
total: 0.06477177 hartree
totalentropycorr: -0.06477177 hartree
gibbsenthalpy: -1912.67458909 hartree
gibbsminuselec: 0.02697510 hartree
