program: Orca
programVersion: 6.0.1
elementType: C C F F C C F C F F F F F F F F S O O O
charge: -1
multiplicity: 1
keywords: B3LYP D3BJ TightOpt Freq def2-TZVPP def2/J RIJCOSX VeryTightSCF defgrid3 KeepDens CHELPG
frequency: 0.00 0.00 0.00 0.00 0.00 0.00 12.46 15.70 17.15 23.61 34.87 49.13 54.74 69.60 99.63 107.05 153.28 179.79 199.92 222.82 233.46 272.67 286.38 327.06 327.68 351.91 371.64 386.49 389.26 407.10 442.54 500.79 532.69 533.14 568.94 570.62 573.46 578.75 607.34 618.89 663.34 698.41 704.46 744.90 868.62 1057.43 1061.16 1102.22 1151.89 1160.59 1174.42 1201.93 1219.03 1247.22 1275.13 1304.03 1313.37 1336.59 1381.60 1807.55
frequency: 12.46 15.70 17.15 23.61 34.87 49.13 54.74 69.60 99.63 107.05 153.28 179.79 199.92 222.82 233.46 272.67 286.38 327.06 327.68 351.91 371.64 386.49 389.26 407.10 442.54 500.79 532.69 533.14 568.94 570.62 573.46 578.75 607.34 618.89 663.34 698.41 704.46 744.90 868.62 1057.43 1061.16 1102.22 1151.89 1160.59 1174.42 1201.93 1219.03 1247.22 1275.13 1304.03 1313.37 1336.59 1381.60 1807.55
formula: C5F11O3S
InChI: InChI=1/C5F10.FO3S/c6-1(2(7)8)3(9,10)4(11,12)5(13,14)15;1-5(2,3)4
20 atoms
C  1.680991 -1.06521 0.590354
C  0.510297 -0.674039 -0.368398
F  1.225697 -1.996062 1.459644
F  2.061938 0.025874 1.293766
C  2.965257 -1.647872 -0.068088
C  -0.625399 -0.01986 0.343959
F  -2.071493 -1.839109 0.525332
C  -1.783379 -0.579678 0.684229
F  -0.422921 1.286166 0.619832
F  0.118238 -1.802648 -0.99643
F  1.026861 0.180483 -1.296071
F  2.695125 -2.737942 -0.788192
F  3.833081 -1.991089 0.898923
F  3.561358 -0.748715 -0.854383
F  -2.709672 0.078386 1.321974
F  -4.082049 -2.070854 -2.534775
S  -4.45161 -0.675791 -1.752418
O  -5.298718 0.003653 -2.703693
O  -3.135763 -0.087248 -1.556196
O  -5.091663 -1.15498 -0.547395
totalener: -1912.75894513109688 hartree
nucrepener: 2085.09571763744816 hartree
electener: -3997.85465644590113 hartree
oneelecener: -6827.93060954119755 hartree
twoeener: 2830.07595309529643 hartree
kineticenergy: 1906.62602907861105 hartree
exchangeener: -148.670904903396 hartree
correlationener: -7.558111137486 hartree
xcener: -156.229016040882 hartree
dispersion: -0.033340727 hartree
dispersion: -0.033370577 hartree
dispersion: -0.033343000 hartree
dispersion: -0.033299630 hartree
dispersion: -0.033237062 hartree
dispersion: -0.033225290 hartree
dispersion: -0.033219058 hartree
dispersion: -0.033221948 hartree
dispersion: -0.033227978 hartree
dispersion: -0.033232772 hartree
dispersion: -0.033239902 hartree
dispersion: -0.033251305 hartree
dispersion: -0.033268843 hartree
dispersion: -0.033280280 hartree
dispersion: -0.033285180 hartree
dispersion: -0.033296839 hartree
dispersion: -0.033311249 hartree
dispersion: -0.033341814 hartree
dispersion: -0.033379050 hartree
dispersion: -0.033474553 hartree
dispersion: -0.033594597 hartree
dispersion: -0.033582440 hartree
dispersion: -0.033567835 hartree
dispersion: -0.033679183 hartree
dispersion: -0.033634714 hartree
dispersion: -0.033635753 hartree
dispersion: -0.033624836 hartree
dispersion: -0.033618399 hartree
dispersion: -0.033606567 hartree
dispersion: -0.033605627 hartree
dispersion: -0.033591358 hartree
dispersion: -0.033593220 hartree
dispersion: -0.033586682 hartree
dispersion: -0.033576657 hartree
dispersion: -0.033557969 hartree
dispersion: -0.033537048 hartree
dispersion: -0.033524351 hartree
dispersion: -0.033519992 hartree
dispersion: -0.033520868 hartree
dispersion: -0.033523235 hartree
dispersion: -0.033524388 hartree
dispersion: -0.033525498 hartree
dispersion: -0.033524383 hartree
dispersion: -0.033518926 hartree
dispersion: -0.033508685 hartree
dispersion: -0.033496559 hartree
dispersion: -0.033482162 hartree
dispersion: -0.033468834 hartree
dispersion: -0.033467534 hartree
dispersion: -0.033468577 hartree
energy: -2419.1942 -671.2166 -671.2139 -671.1904 -670.9028 -670.9015 -670.3384 -670.3092 -670.3045 -670.2389 -669.8276 -667.0285 -515.5304 -515.4307 -515.4271 -282.4677 -280.6090 -280.3060 -279.4238 -276.9874 -216.1334 -160.8319 -160.6481 -160.6380 -34.6669 -33.3759 -32.9644 -32.6698 -32.2570 -32.1291 -31.7370 -31.4388 -31.1887 -31.0324 -28.6847 -25.5240 -22.6187 -22.5927 -20.4445 -19.6431 -18.0176 -16.7148 -15.4234 -15.1617 -15.1251 -14.9610 -14.2329 -14.1625 -13.9409 -13.7299 -13.0962 -12.5428 -12.3136 -12.0473 -11.6694 -11.6181 -11.5169 -10.9700 -10.9153 -10.6439 -10.4964 -10.3307 -10.1454 -10.0734 -9.9937 -9.9640 -9.8512 -9.7903 -9.6139 -9.4904 -9.4416 -9.2092 -8.7920 -8.6164 -8.5293 -7.5036 -7.0623 -7.0198 -5.5981 -5.2587 -5.1588 -4.5973 -3.8963 -3.8483 -2.9352 2.2034 2.8323 3.8767 4.2845 4.6672 5.1521 6.0844 6.2749 6.4550 6.6774 7.1331 electronvolt
chargesum: -1.0000000
charge: 0.312386 0.354198 -0.177574 -0.178146 0.455626 0.075444 -0.134580 0.417814 -0.207058 -0.166562 -0.184679 -0.154338 -0.168529 -0.157055 -0.136248 -0.314658 0.971036 -0.527549 -0.549975 -0.529553
charge: -0.456988 -0.468674 0.210725 0.210359 -0.661513 -0.284521 0.282935 -0.448282 0.192347 0.224482 0.195513 0.223093 0.202172 0.219602 0.280993 -0.190005 0.347015 -0.358482 -0.354867 -0.365907
qa: 0.3124 0.3542 -0.1776 -0.1781 0.4556 0.0754 -0.1346 0.4178 -0.2071 -0.1666 -0.1847 -0.1543 -0.1685 -0.1571 -0.1362 -0.3147 0.9710 -0.5275 -0.5500 -0.5296
va: 4.1211 4.1593 1.1339 1.1344 4.5233 3.7749 1.2053 4.2420 1.0815 1.1472 1.1262 1.1612 1.1413 1.1574 1.2077 0.9259 6.3479 1.9488 1.8507 1.8963
dispersion: -0.033470058 hartree
energy: -1912.796407409519 hartree
dipole: -11.529617368 17.190899262 5.661281893 1.725403481 -2.291257237 -0.565853757 -3.355771684 5.622513772 2.266742088
dipolemethod: SCF
magnitude: 6.124412040 au
magnitude: 15.567018275 debye
temp: 298.15 k
press: 1.00 atm
zeropoint: 0.07425555 hartree
thermalvibcorrection: 0.01719242 hartree
thermalrotcorrection: 0.00141627 hartree
thermaltrasncorrection: 0.00141627 hartree
thermaltotal: -1912.70212689 hartree
thermalcorr: 0.02002496 hartree
nonthermalcorr: 0.07425555 hartree
totalcorr: 0.09428052 hartree
thermalcorrenthalpy: 0.00094421 hartree
totalenthalpy: -1912.70118268 hartree
vibrat: 0.03251787 hartree
rotat: 0.01635568 hartree
transl: 0.02064181 hartree
total: 0.06951536 hartree
totalentropycorr: -0.06951536 hartree
gibbsenthalpy: -1912.77069804 hartree
gibbsminuselec: 0.02570937 hartree
