program: Orca
programVersion: 6.0.1
elementType: C C F F C C F C F F F F F F F F S O O O
charge: -1
multiplicity: 1
keywords: DLPNO-CCSD(T) def2-TZVPP def2-TZVPP/C VeryTightSCF TightPNO KeepDens CHELPG
formula: C5F11O3S
InChI: InChI=1/C5F11O3S/c6-1(7,2(8,9)4(11,12)13)3(10,5(14,15)16)20(17,18)19
20 atoms
C  1.255799 -1.298139 0.445622
C  0.116689 -0.636015 -0.406201
F  0.820346 -2.457573 0.984606
F  1.649008 -0.47444 1.440782
C  2.551562 -1.651962 -0.356922
C  -1.075645 0.032862 0.33477
F  -0.863706 -0.929093 2.518963
C  -1.700923 -0.834777 1.450568
F  -0.570355 1.154286 0.955489
F  -0.337807 -1.595472 -1.240969
F  0.749793 0.316767 -1.132342
F  2.281549 -2.365728 -1.452121
F  3.35257 -2.392818 0.431922
F  3.234478 -0.562047 -0.711153
F  -2.832168 -0.306155 1.917494
F  -1.953088 -2.083599 1.039969
S  -2.452348 0.600535 -0.92092
O  -3.237529 -0.609254 -1.074056
O  -1.702493 1.011932 -2.089662
O  -3.07514 1.67161 -0.171187
totalener: -1905.98323979488350 hartree
nucrepener: 2312.05904355079156 hartree
electener: -4218.04228334567506 hartree
oneelecener: -7281.04018403981991 hartree
twoeener: 3062.99790069414485 hartree
kineticenergy: 1904.23323716877212 hartree
energy: -2504.3307 -714.9802 -714.9363 -714.9281 -714.5663 -714.5539 -713.8771 -713.8311 -713.7856 -713.7810 -713.6958 -713.0873 -554.7638 -554.7630 -554.7298 -311.6209 -310.5189 -309.6950 -309.2234 -306.5896 -244.8198 -181.8792 -181.8418 -181.8401 -45.4259 -44.2157 -43.9778 -43.2508 -42.8323 -42.6865 -42.2660 -41.6930 -41.5566 -41.4865 -41.2812 -36.1101 -32.1054 -32.0737 -27.6856 -26.5577 -24.4936 -23.1908 -22.0024 -21.1169 -20.8770 -20.8334 -20.1433 -19.7624 -19.6251 -19.5200 -19.2373 -18.6658 -18.5455 -17.7349 -17.6733 -17.5526 -17.4940 -17.0252 -16.9074 -16.5772 -16.4637 -16.3326 -16.2570 -16.0654 -16.0106 -15.8865 -15.7743 -15.5513 -15.2102 -15.1912 -15.0008 -14.8874 -14.7618 -14.2210 -13.9132 -13.7173 -13.6893 -12.8263 -11.7091 -10.3129 -10.2600 -9.1760 -9.1174 -8.2053 -7.8154 7.9122 8.3409 8.6543 9.4580 9.7628 10.0176 10.6456 10.7738 11.3627 11.5487 11.9680 electronvolt
chargesum: -1.0000000
charge: 0.487067 0.378398 -0.242327 -0.238806 0.629083 0.229745 -0.260842 0.598332 -0.273046 -0.237728 -0.233569 -0.225111 -0.238275 -0.223936 -0.221237 -0.233896 1.225373 -0.638864 -0.641312 -0.639048
charge: -0.366598 -0.389110 0.165499 0.166803 -0.523552 -0.329632 0.124788 -0.547118 0.112906 0.171413 0.168307 0.174868 0.151165 0.173656 0.179212 0.167507 0.585807 -0.398842 -0.393998 -0.393079
qa: 0.4871 0.3784 -0.2423 -0.2388 0.6291 0.2297 -0.2608 0.5983 -0.2730 -0.2377 -0.2336 -0.2251 -0.2383 -0.2239 -0.2212 -0.2339 1.2254 -0.6389 -0.6413 -0.6390
va: 4.1319 4.2355 1.0309 1.0370 4.2916 3.8422 0.9895 4.3116 0.9733 1.0393 1.0306 1.0536 1.0259 1.0520 1.0501 1.0340 6.0136 1.7703 1.7829 1.7872
e0: -1905.983239796 hartree
corrType: DLPNO BASED
energy: -1910.538540543385 hartree
dipole: -7.737279925 11.005071126 3.267791201 4.364806982 -6.230042708 -1.865235725 -3.696162148 5.034943155 1.338781007
dipolemethod: SCF
magnitude: 3.993732368 au
magnitude: 10.151260945 debye
