program: Orca
programVersion: 6.0.1
elementType: C C F F C C F C F F F F F F F F S O O O
charge: -1
multiplicity: 1
keywords: B3LYP D3BJ def2-TZVP VeryTightSCF IRC defgrid3 KeepDens CHELPG
keywords: PAL8
formula: C5F11O3S
InChI: InChI=1/C5F11.O3S/c6-1(3(9,10)11)2(7,8)4(12,13)5(14,15)16;1-4(2)3
20 atoms
C  1.891789 -0.517131 0.527798
C  0.754088 0.04426 -0.407289
F  1.404077 -1.597128 1.194123
F  2.227641 0.424447 1.444556
C  3.229644 -0.984165 -0.112632
C  -0.465116 0.558608 0.202722
F  -1.542963 -1.507136 0.376143
C  -1.412408 -0.272113 0.87885
F  -0.231331 1.734434 0.934604
F  0.486685 -0.982039 -1.277817
F  1.389936 1.050877 -1.121387
F  3.040803 -1.948317 -1.021366
F  4.043635 -1.486747 0.842651
F  3.884497 0.024506 -0.698575
F  -1.306745 -0.408572 2.249146
F  -2.759465 0.286566 0.814723
S  -3.6243 1.369462 -1.161681
O  -4.916843 1.23925 -0.562149
O  -3.182509 0.376113 -2.084314
O  -2.911114 2.594823 -1.018107
totalener: -1912.69974231540141 hartree
nucrepener: 2151.81085611082972 hartree
electener: -4064.51059507813898 hartree
oneelecener: -6964.14394840019850 hartree
twoeener: 2899.63335332205952 hartree
kineticenergy: 1907.00306133351000 hartree
exchangeener: -148.681000833497 hartree
correlationener: -7.561827086761 hartree
xcener: -156.242827920258 hartree
energy: -2421.2544 -670.0809 -670.0684 -670.0168 -669.3920 -669.3646 -668.8827 -668.5680 -668.3416 -668.3364 -668.2819 -667.2610 -518.7392 -518.7350 -518.7237 -281.2018 -279.5199 -278.9793 -278.3195 -273.9201 -218.4274 -163.1351 -162.9022 -162.8990 -33.4482 -31.7941 -31.5110 -31.0669 -30.9368 -30.6378 -30.1872 -29.4731 -29.2862 -29.1643 -28.7175 -28.3569 -25.7730 -25.7173 -18.7150 -17.8096 -16.3488 -15.3551 -14.0839 -13.9093 -13.7250 -13.6117 -13.4373 -12.6059 -12.5198 -12.3574 -11.9624 -11.8523 -11.4893 -11.0234 -10.7991 -10.7563 -10.4746 -10.4383 -10.2546 -10.1957 -9.6162 -9.4217 -9.2249 -9.1619 -8.9575 -8.8701 -8.8237 -8.5524 -8.3305 -8.2050 -8.0481 -7.9966 -7.9404 -7.9105 -7.8142 -7.7685 -7.5655 -7.3590 -7.3329 -7.1806 -7.0802 -6.7064 -5.8003 -5.7886 -1.5123 1.1392 2.0386 4.2469 4.6579 5.4056 5.7347 6.2851 6.9139 7.2024 7.3290 7.5828 electronvolt
chargesum: -1.0000000
charge: 0.317910 0.342892 -0.197525 -0.190602 0.451795 -0.178164 -0.187178 0.465833 -0.284806 -0.211985 -0.224709 -0.169156 -0.184607 -0.167882 -0.217554 -0.268219 0.987893 -0.386367 -0.352731 -0.344837
charge: -0.455394 -0.501108 0.192417 0.196082 -0.653782 -0.389360 0.199038 -0.621792 0.078335 0.168070 0.140867 0.206567 0.179932 0.207041 0.120655 0.043499 0.576388 -0.250053 -0.222009 -0.215392
qa: 0.3179 0.3429 -0.1975 -0.1906 0.4518 -0.1782 -0.1872 0.4658 -0.2848 -0.2120 -0.2247 -0.1692 -0.1846 -0.1679 -0.2176 -0.2682 0.9879 -0.3864 -0.3527 -0.3448
va: 4.0155 4.1042 1.1088 1.1143 4.5330 3.2292 1.1034 4.4605 0.9482 1.0688 1.0562 1.1379 1.1146 1.1385 1.0517 0.9910 5.8488 2.0651 2.0879 2.0956
dispersion: -0.034350113 hartree
energy: -1912.734092428047 hartree
dipole: -11.145011144 12.151796706 1.006785562 4.499606785 -5.102430517 -0.602823732 -3.826703762 3.535581156 -0.291122606
dipolemethod: SCF
magnitude: 1.209035149 au
magnitude: 3.073123123 debye
temp: 298.15 k
press: 1.00 atm
zeropoint: 0.07122192 hartree
thermalvibcorrection: 0.01562571 hartree
thermalrotcorrection: 0.00141627 hartree
thermaltrasncorrection: 0.00141627 hartree
thermaltotal: -1912.64441225 hartree
thermalcorr: 0.01845826 hartree
nonthermalcorr: 0.07122192 hartree
totalcorr: 0.08968017 hartree
thermalcorrenthalpy: 0.00094421 hartree
totalenthalpy: -1912.64346805 hartree
vibrat: 0.02806043 hartree
rotat: 0.01621273 hartree
transl: 0.02064181 hartree
total: 0.06491497 hartree
totalentropycorr: -0.06491497 hartree
gibbsenthalpy: -1912.70838301 hartree
gibbsminuselec: 0.02570941 hartree
