program: Orca
programVersion: 6.0.1
elementType: C C F F C C F C F F F F F F F F S O O O
charge: -1
multiplicity: 1
keywords: B3LYP D3BJ TightOpt Freq def2-TZVPP def2/J RIJCOSX VeryTightSCF defgrid3 KeepDens CHELPG
frequency: 0.00 0.00 0.00 0.00 0.00 0.00 29.70 36.39 58.23 59.27 79.32 105.26 126.97 142.65 195.71 212.66 229.79 232.88 239.93 249.73 277.70 289.21 297.55 297.92 319.55 340.05 354.28 368.73 385.88 414.09 492.34 518.68 526.47 534.02 554.72 564.57 591.21 610.96 631.39 672.69 679.20 741.22 814.95 893.72 1039.68 1090.02 1101.81 1110.10 1134.93 1155.31 1160.03 1180.51 1194.63 1212.35 1219.40 1261.92 1274.10 1293.38 1295.53 1329.51
frequency: 29.70 36.39 58.23 59.27 79.32 105.26 126.97 142.65 195.71 212.66 229.79 232.88 239.93 249.73 277.70 289.21 297.55 297.92 319.55 340.05 354.28 368.73 385.88 414.09 492.34 518.68 526.47 534.02 554.72 564.57 591.21 610.96 631.39 672.69 679.20 741.22 814.95 893.72 1039.68 1090.02 1101.81 1110.10 1134.93 1155.31 1160.03 1180.51 1194.63 1212.35 1219.40 1261.92 1274.10 1293.38 1295.53 1329.51
formula: C5F11O3S
InChI: InChI=1/C5F11O3S/c6-1(7,2(8,9)4(12,13)14)3(10,11)5(15,16)20(17,18)19
20 atoms
C  1.30386 -1.310309 0.466338
C  0.176735 -0.698427 -0.421718
F  0.888564 -2.483228 0.977606
F  1.621859 -0.472071 1.47221
C  2.636449 -1.602915 -0.299124
C  -1.054809 -0.029729 0.300416
F  -1.015047 -1.042955 2.406048
C  -1.832235 -0.899094 1.324581
F  -0.5863 1.083352 0.901926
F  -0.255249 -1.660839 -1.260717
F  0.753901 0.275271 -1.179339
F  2.420768 -2.316591 -1.408414
F  3.445383 -2.31174 0.502395
F  3.273936 -0.477892 -0.631135
F  -1.868651 0.340138 -0.710904
F  -1.993393 -2.136779 0.776989
S  -3.510826 -0.230505 1.87843
O  -3.810705 -1.120804 2.983896
O  -4.331587 -0.400745 0.694985
O  -3.199679 1.140853 2.238629
totalener: -1912.76387208324991 hartree
nucrepener: 2252.33423518402060 hartree
electener: -4165.09811355540842 hartree
oneelecener: -7162.84267317453669 hartree
twoeener: 2997.74455961912872 hartree
kineticenergy: 1906.61377055715957 hartree
exchangeener: -148.665676716490 hartree
correlationener: -7.569965963451 hartree
xcener: -156.235642679941 hartree
dispersion: -0.038039069 hartree
dispersion: -0.038200493 hartree
dispersion: -0.038296426 hartree
dispersion: -0.038270775 hartree
dispersion: -0.038264875 hartree
dispersion: -0.038264003 hartree
dispersion: -0.038265129 hartree
dispersion: -0.038264216 hartree
energy: -2418.6395 -671.1216 -671.0883 -671.0693 -670.6468 -670.6218 -670.3563 -670.3276 -669.5593 -669.5390 -668.9603 -668.9501 -515.5319 -515.5223 -515.5016 -282.3356 -280.5660 -280.1614 -279.4734 -278.4047 -215.6696 -160.3036 -160.2021 -160.2009 -34.5536 -33.2416 -32.8181 -32.1371 -32.0379 -31.9974 -31.5464 -31.2661 -31.1211 -30.4315 -29.6886 -26.2554 -22.5967 -22.5829 -20.1586 -18.9390 -17.5122 -16.6106 -15.4871 -15.0615 -14.9938 -14.8502 -14.1086 -14.0425 -13.6346 -13.3736 -12.9745 -12.7514 -12.4650 -11.8849 -11.5244 -11.5024 -11.3625 -10.9804 -10.7588 -10.5194 -10.4390 -10.3125 -10.1128 -10.0515 -9.8459 -9.7585 -9.6101 -9.4082 -9.3680 -9.2432 -8.8548 -8.7674 -8.6313 -8.5298 -8.0922 -8.0521 -7.9418 -7.5246 -6.8522 -5.1959 -5.1840 -4.3461 -4.2949 -3.9702 -2.9439 3.1342 3.1779 4.5442 4.7876 4.9802 5.9602 6.0350 6.3716 6.8626 7.0003 7.1113 electronvolt
chargesum: -1.0000000
charge: 0.310775 0.288624 -0.162659 -0.166827 0.459006 0.332916 -0.203175 0.244798 -0.172821 -0.170712 -0.186454 -0.160046 -0.164591 -0.158320 -0.165970 -0.204254 0.825479 -0.516199 -0.513691 -0.515882
charge: -0.474850 -0.446935 0.228104 0.223080 -0.659891 -0.490086 0.164869 -0.578984 0.213823 0.216819 0.195049 0.217150 0.207466 0.217139 0.218895 0.162707 0.414071 -0.340614 -0.343229 -0.344583
qa: 0.3108 0.2886 -0.1627 -0.1668 0.4590 0.3329 -0.2032 0.2448 -0.1728 -0.1707 -0.1865 -0.1600 -0.1646 -0.1583 -0.1660 -0.2043 0.8255 -0.5162 -0.5137 -0.5159
va: 4.1204 4.1956 1.1546 1.1501 4.5417 4.2023 1.0955 3.9742 1.1363 1.1426 1.1222 1.1531 1.1465 1.1542 1.1537 1.0842 6.2209 1.9434 1.9194 1.9173
dispersion: -0.038264286 hartree
energy: -1912.805258076964 hartree
dipole: -10.698335304 15.458788702 4.760453398 2.193932810 -3.119784888 -0.925852078 4.340166554 -6.302723150 -1.962556596
dipolemethod: SCF
magnitude: 5.231705937 au
magnitude: 13.297939688 debye
temp: 298.15 k
press: 1.00 atm
zeropoint: 0.07568713 hartree
thermalvibcorrection: 0.01559304 hartree
thermalrotcorrection: 0.00141627 hartree
thermaltrasncorrection: 0.00141627 hartree
thermaltotal: -1912.71114537 hartree
thermalcorr: 0.01842558 hartree
nonthermalcorr: 0.07568713 hartree
totalcorr: 0.09411271 hartree
thermalcorrenthalpy: 0.00094421 hartree
totalenthalpy: -1912.71020116 hartree
vibrat: 0.02751355 hartree
rotat: 0.01600953 hartree
transl: 0.02064181 hartree
total: 0.06416489 hartree
totalentropycorr: -0.06416489 hartree
gibbsenthalpy: -1912.77436605 hartree
gibbsminuselec: 0.03089203 hartree
