program: Orca
programVersion: 6.0.1
elementType: C C F F C C F C F F F F F F F F S O O O
charge: -1
multiplicity: 1
keywords: B3LYP D3BJ TightOpt Freq def2-TZVPP def2/J RIJCOSX VeryTightSCF defgrid3 KeepDens CHELPG
frequency: 0.00 0.00 0.00 0.00 0.00 0.00 37.75 53.67 63.08 75.33 89.65 96.52 147.94 161.27 169.83 189.74 228.49 235.32 247.45 255.28 269.13 276.17 293.51 311.15 318.73 331.81 350.03 375.75 392.99 474.41 511.35 523.09 527.53 537.59 542.02 583.48 593.37 613.90 618.32 667.46 719.41 735.54 775.54 925.54 988.93 1047.36 1093.19 1108.09 1133.84 1148.62 1163.93 1176.88 1204.09 1207.82 1227.35 1244.29 1271.24 1300.86 1305.44 1322.63
frequency: 37.75 53.67 63.08 75.33 89.65 96.52 147.94 161.27 169.83 189.74 228.49 235.32 247.45 255.28 269.13 276.17 293.51 311.15 318.73 331.81 350.03 375.75 392.99 474.41 511.35 523.09 527.53 537.59 542.02 583.48 593.37 613.90 618.32 667.46 719.41 735.54 775.54 925.54 988.93 1047.36 1093.19 1108.09 1133.84 1148.62 1163.93 1176.88 1204.09 1207.82 1227.35 1244.29 1271.24 1300.86 1305.44 1322.63
formula: C5F11O3S
InChI: InChI=1/C5F11O3S/c6-1(7,2(8,9)4(11,12)13)3(10,5(14,15)16)20(17,18)19
20 atoms
C  1.255799 -1.298139 0.445622
C  0.116689 -0.636015 -0.406201
F  0.820346 -2.457573 0.984606
F  1.649008 -0.47444 1.440782
C  2.551562 -1.651962 -0.356922
C  -1.075645 0.032862 0.33477
F  -0.863706 -0.929093 2.518963
C  -1.700923 -0.834777 1.450568
F  -0.570355 1.154286 0.955489
F  -0.337807 -1.595472 -1.240969
F  0.749793 0.316767 -1.132342
F  2.281549 -2.365728 -1.452121
F  3.35257 -2.392818 0.431922
F  3.234478 -0.562047 -0.711153
F  -2.832168 -0.306155 1.917494
F  -1.953088 -2.083599 1.039969
S  -2.452348 0.600535 -0.92092
O  -3.237529 -0.609254 -1.074056
O  -1.702493 1.011932 -2.089662
O  -3.07514 1.67161 -0.171187
totalener: -1912.77061026598994 hartree
nucrepener: 2299.74344950045952 hartree
electener: -4212.51406559502175 hartree
oneelecener: -7258.77755218968923 hartree
twoeener: 3046.26348659466748 hartree
kineticenergy: 1906.62113937856998 hartree
exchangeener: -148.667140872321 hartree
correlationener: -7.572397623861 hartree
xcener: -156.239538496181 hartree
dispersion: -0.040175957 hartree
dispersion: -0.040340734 hartree
dispersion: -0.040532996 hartree
dispersion: -0.040439098 hartree
dispersion: -0.040438603 hartree
dispersion: -0.040455420 hartree
dispersion: -0.040467369 hartree
dispersion: -0.040459464 hartree
dispersion: -0.040457255 hartree
dispersion: -0.040462284 hartree
energy: -2418.8477 -670.7080 -670.6764 -670.6689 -670.2696 -670.2576 -669.5817 -669.5573 -669.5174 -669.4974 -669.4399 -668.8310 -515.7088 -515.7023 -515.7014 -281.9232 -280.8067 -280.0697 -279.5884 -277.0723 -215.8787 -160.5238 -160.4053 -160.4034 -34.1401 -32.9275 -32.7344 -32.0294 -31.7283 -31.5883 -31.1364 -30.5760 -30.4416 -30.3749 -30.1654 -26.4598 -22.7994 -22.7940 -19.6716 -18.7930 -17.1833 -16.1975 -15.2374 -14.6013 -14.5832 -14.5065 -13.7544 -13.5827 -13.4026 -13.2990 -12.9511 -12.5420 -12.3282 -11.7208 -11.1443 -11.1074 -10.9880 -10.4452 -10.4090 -10.1968 -9.9962 -9.9112 -9.8864 -9.7264 -9.5287 -9.4429 -9.3433 -9.2343 -9.1019 -8.8910 -8.8206 -8.5791 -8.5003 -8.3375 -8.2360 -8.1700 -8.1108 -7.5356 -6.6338 -5.3850 -5.3497 -4.5008 -4.4542 -4.1301 -3.1253 3.4420 3.6789 4.6932 5.1011 5.3196 6.0867 6.3794 6.6544 6.8497 7.1901 7.5757 electronvolt
chargesum: -1.0000000
charge: 0.325482 0.288446 -0.179891 -0.176725 0.459449 0.099240 -0.197419 0.443540 -0.216603 -0.176425 -0.174584 -0.158196 -0.173832 -0.157385 -0.155288 -0.168739 0.829452 -0.501295 -0.505474 -0.503752
charge: -0.466355 -0.484299 0.211423 0.212435 -0.658984 -0.394832 0.167959 -0.679570 0.157691 0.217551 0.214991 0.219672 0.195230 0.217932 0.222975 0.211399 0.433954 -0.336496 -0.332966 -0.329709
qa: 0.3255 0.2884 -0.1799 -0.1767 0.4594 0.0992 -0.1974 0.4435 -0.2166 -0.1764 -0.1746 -0.1582 -0.1738 -0.1574 -0.1553 -0.1687 0.8295 -0.5013 -0.5055 -0.5038
va: 4.1424 4.1667 1.1299 1.1370 4.5527 3.7422 1.0952 4.5402 1.0641 1.1387 1.1371 1.1555 1.1322 1.1549 1.1622 1.1385 6.2141 1.9237 1.9454 1.9503
dispersion: -0.040461782 hartree
energy: -1912.814145465313 hartree
dipole: -7.737279925 10.878071663 3.140791737 4.364806982 -6.142638163 -1.777831180 -3.696162148 4.964188929 1.268026781
dipolemethod: SCF
magnitude: 3.825329836 au
magnitude: 9.723215728 debye
temp: 298.15 k
press: 1.00 atm
zeropoint: 0.07578027 hartree
thermalvibcorrection: 0.01543377 hartree
thermalrotcorrection: 0.00141627 hartree
thermaltrasncorrection: 0.00141627 hartree
thermaltotal: -1912.72009888 hartree
thermalcorr: 0.01826631 hartree
nonthermalcorr: 0.07578027 hartree
totalcorr: 0.09404658 hartree
thermalcorrenthalpy: 0.00094421 hartree
totalenthalpy: -1912.71915467 hartree
vibrat: 0.02705389 hartree
rotat: 0.01594478 hartree
transl: 0.02064181 hartree
total: 0.06364048 hartree
totalentropycorr: -0.06364048 hartree
gibbsenthalpy: -1912.78279515 hartree
gibbsminuselec: 0.03135032 hartree
