program: Orca
programVersion: 6.0.1
elementType: C C F F C C F C F F F F F F F F S O O O
charge: -1
multiplicity: 1
keywords: DLPNO-CCSD(T) def2-TZVPP def2-TZVPP/C VeryTightSCF TightPNO KeepDens CHELPG
formula: C5F11O3S
InChI: InChI=1/C5F11.O3S/c6-1(3(9,10)11)2(7,8)4(12,13)5(14,15)16;1-4(2)3
20 atoms
C  1.172777 -0.847034 0.117489
C  0.540255 0.557463 0.002292
F  0.340487 -1.805448 -0.342328
F  1.473082 -1.132845 1.41426
C  2.528099 -1.041175 -0.644481
C  -0.542755 0.926715 0.819889
F  -0.593111 0.401262 3.170967
C  -1.181281 0.222349 1.918093
F  -0.68648 2.302541 0.954732
F  0.177759 0.590062 -1.484091
F  1.568733 1.484751 -0.028037
F  2.460634 -0.731557 -1.936835
F  2.871685 -2.344154 -0.556156
F  3.518309 -0.335008 -0.086032
F  -2.45979 0.651439 2.121283
F  -1.230049 -1.115259 1.744922
S  -2.413609 0.558417 -1.75975
O  -2.715402 -0.673509 -1.100579
O  -2.015739 0.52446 -3.134862
O  -2.813603 1.80653 -1.190777
totalener: -1905.86896457677494 hartree
nucrepener: 2228.92093560620606 hartree
electener: -4134.78990018298100 hartree
oneelecener: -7116.68483646567347 hartree
twoeener: 2981.89493628269247 hartree
kineticenergy: 1904.11069122168897 hartree
energy: -2506.8799 -714.2815 -714.2802 -714.2477 -713.7244 -713.7149 -712.8411 -712.6709 -712.4524 -712.1021 -711.4673 -711.2854 -558.0019 -557.9926 -557.9007 -310.9258 -309.2255 -308.9648 -307.8597 -302.6884 -247.5043 -184.5980 -184.4728 -184.4719 -44.7333 -43.0998 -42.6552 -42.1409 -42.0044 -41.3731 -41.2674 -40.3967 -39.7283 -39.3117 -39.0406 -38.7873 -35.0926 -34.9876 -26.9400 -25.4361 -23.4670 -22.2581 -20.4998 -20.2213 -20.1361 -19.8490 -19.7351 -18.9353 -18.5435 -18.2495 -18.0424 -17.6991 -16.9590 -16.8517 -16.7775 -16.5572 -16.4415 -16.3594 -16.3411 -16.0479 -15.9538 -15.6604 -15.5973 -15.5017 -15.2446 -15.1749 -15.0935 -14.9271 -14.2443 -14.1852 -13.9879 -13.7725 -13.6901 -13.5895 -13.3968 -13.3200 -13.0635 -12.9518 -12.8926 -12.0233 -11.6362 -11.5110 -11.2872 -10.6998 -5.0075 5.0803 6.8661 8.6476 8.8399 9.2138 10.2575 10.7338 10.9391 11.3386 11.5436 11.7798 electronvolt
chargesum: -1.0000000
charge: 0.534614 0.478480 -0.241507 -0.253185 0.628445 -0.244955 -0.300546 0.696981 -0.330462 -0.400683 -0.274146 -0.222205 -0.246865 -0.233681 -0.271177 -0.266971 1.378178 -0.470048 -0.498405 -0.461861
charge: -0.348054 -0.321974 0.165008 0.149683 -0.518010 -0.370644 0.047139 -0.525654 0.052208 -0.103976 0.102451 0.179196 0.140787 0.162092 0.108883 0.138588 0.777326 -0.273489 -0.295997 -0.265564
qa: 0.5346 0.4785 -0.2415 -0.2532 0.6284 -0.2450 -0.3005 0.6970 -0.3305 -0.4007 -0.2741 -0.2222 -0.2469 -0.2337 -0.2712 -0.2670 1.3782 -0.4700 -0.4984 -0.4619
va: 4.0681 4.0820 1.0257 1.0147 4.2884 3.2507 0.9156 4.2630 0.8404 0.7736 0.9509 1.0557 1.0127 1.0375 0.9655 0.9736 5.6992 1.9478 1.9427 1.9602
e0: -1905.868964577 hartree
corrType: DLPNO BASED
energy: -1910.442332910644 hartree
dipole: -7.708414413 8.507713057 0.799298644 1.997847447 -3.025242470 -1.027395023 -5.283152613 4.712699865 -0.570452748
dipolemethod: SCF
magnitude: 1.421209060 au
magnitude: 3.612426347 debye
