program: Orca
programVersion: 6.0.1
elementType: C C F F C C F C F F F F F F F F S O O O
charge: -1
multiplicity: 1
keywords: B3LYP D3BJ def2-TZVP VeryTightSCF IRC defgrid3 KeepDens CHELPG
keywords: PAL8
formula: C5F11O3S
InChI: InChI=1/C5F10.F.O3S/c6-1(2(7)8)3(9,10)4(11,12)5(13,14)15;;1-4(2)3
20 atoms
C  1.803825 0.443339 0.109161
C  0.390679 -0.17289 -0.203017
F  2.182305 0.147363 1.357816
F  1.808757 1.770017 -0.097516
C  2.93224 -0.130743 -0.820663
C  -0.818474 0.586076 0.29348
F  -2.594403 1.004561 1.723703
C  -1.609627 0.249055 1.339868
F  0.074698 1.637467 1.998165
F  0.387292 -1.432605 0.280923
F  0.312681 -0.232248 -1.563587
F  2.914199 -1.468808 -0.859982
F  4.125668 0.249716 -0.33274
F  2.846821 0.332029 -2.07123
F  -1.099459 1.670728 -0.399044
F  -1.390536 -0.755425 2.131249
S  -2.937171 -0.895511 -0.630253
O  -3.630299 -1.589174 0.436074
O  -2.132484 -1.700637 -1.520316
O  -3.566693 0.287701 -1.172079
totalener: -1912.66143155737814 hartree
nucrepener: 2239.95098944856500 hartree
electener: -4152.61242157962442 hartree
oneelecener: -7138.79503409047993 hartree
twoeener: 2986.18261251085596 hartree
kineticenergy: 1906.98004431421236 hartree
exchangeener: -148.667002826817 hartree
correlationener: -7.563694937487 hartree
xcener: -156.230697764304 hartree
energy: -2420.1027 -670.5034 -670.4592 -670.4444 -670.3336 -670.2419 -669.8853 -669.8190 -669.7864 -669.7317 -669.7154 -663.2626 -517.5794 -517.5655 -517.5609 -281.6539 -279.8668 -279.8392 -279.6095 -277.8108 -217.2438 -161.8896 -161.7531 -161.7490 -33.9044 -32.9823 -32.4816 -32.0904 -31.5813 -31.4883 -31.3745 -31.2597 -30.7824 -30.5573 -27.9748 -24.4839 -24.4635 -23.2216 -19.8416 -19.0676 -17.4959 -16.1062 -15.1226 -14.4509 -14.3397 -14.2844 -13.8698 -13.8382 -13.4023 -13.1244 -12.9097 -12.7081 -12.4265 -12.1739 -10.9331 -10.8940 -10.6689 -10.5315 -10.3076 -10.1245 -10.0895 -9.9443 -9.8707 -9.8447 -9.7880 -9.6652 -9.6325 -9.5724 -9.4892 -9.2770 -9.1422 -8.9812 -8.7259 -8.6687 -8.1701 -6.9419 -6.9216 -6.8421 -6.1129 -6.0987 -5.2608 -4.7770 -3.6474 -3.5461 -2.6796 0.6218 2.3660 3.6151 4.3578 4.6474 5.0645 5.5061 6.2044 6.5068 6.9218 7.2974 electronvolt
chargesum: -1.0000000
charge: 0.369950 0.264575 -0.151654 -0.161464 0.448398 0.235853 -0.119091 0.357373 -0.653254 -0.183216 -0.184155 -0.166493 -0.171915 -0.163062 -0.148275 -0.123440 0.815777 -0.427885 -0.418428 -0.419593
charge: -0.479400 -0.454174 0.236000 0.230139 -0.656268 -0.312658 0.292152 -0.513519 -0.554636 0.219560 0.200952 0.209671 0.198024 0.210417 0.274219 0.291630 0.491096 -0.298429 -0.291757 -0.293018
qa: 0.3700 0.2646 -0.1517 -0.1615 0.4484 0.2359 -0.1191 0.3574 -0.6533 -0.1832 -0.1842 -0.1665 -0.1719 -0.1631 -0.1483 -0.1234 0.8158 -0.4279 -0.4184 -0.4196
va: 4.1651 4.2189 1.1607 1.1554 4.5561 3.8135 1.2204 4.4553 0.6076 1.1254 1.1200 1.1428 1.1342 1.1458 1.1638 1.2095 5.8789 1.9736 1.9944 1.9827
dispersion: -0.039943687 hartree
energy: -1912.701375244054 hartree
dipole: -9.770466712 11.524414661 1.753947950 -3.003621021 2.337480199 -0.666140822 -2.212755511 1.321801313 -0.890954198
dipolemethod: SCF
magnitude: 2.076987335 au
magnitude: 5.279282253 debye
temp: 298.15 k
press: 1.00 atm
zeropoint: 0.07216479 hartree
thermalvibcorrection: 0.01582224 hartree
thermalrotcorrection: 0.00141627 hartree
thermaltrasncorrection: 0.00141627 hartree
thermaltotal: -1912.61055567 hartree
thermalcorr: 0.01865478 hartree
nonthermalcorr: 0.07216479 hartree
totalcorr: 0.09081957 hartree
thermalcorrenthalpy: 0.00094421 hartree
totalenthalpy: -1912.60961146 hartree
vibrat: 0.02803294 hartree
rotat: 0.01605415 hartree
transl: 0.02064181 hartree
total: 0.06472890 hartree
totalentropycorr: -0.06472890 hartree
gibbsenthalpy: -1912.67434036 hartree
gibbsminuselec: 0.02703488 hartree
