program: Orca
programVersion: 6.0.0
elementType: C C F F C C F C F F F F F F F F S O O O
charge: -1
multiplicity: 1
keywords: B3LYP D3BJ TightOpt Freq def2-TZVPP def2/J RIJCOSX VeryTightSCF defgrid3
frequency: 0.00 0.00 0.00 0.00 0.00 0.00 44.39 53.13 60.34 67.83 91.91 132.47 150.55 157.82 180.03 194.61 218.36 235.86 244.54 265.12 268.33 283.43 293.82 307.12 320.92 324.16 366.50 385.77 419.35 442.08 488.91 520.52 538.11 539.52 545.29 582.25 586.44 618.66 642.93 667.67 720.81 745.11 814.39 849.84 1014.55 1048.64 1076.71 1091.47 1105.71 1156.60 1167.89 1177.47 1205.49 1209.90 1214.51 1225.11 1290.02 1301.77 1305.12 1319.78
frequency: 44.39 53.13 60.34 67.83 91.91 132.47 150.55 157.82 180.03 194.61 218.36 235.86 244.54 265.12 268.33 283.43 293.82 307.12 320.92 324.16 366.50 385.77 419.35 442.08 488.91 520.52 538.11 539.52 545.29 582.25 586.44 618.66 642.93 667.67 720.81 745.11 814.39 849.84 1014.55 1048.64 1076.71 1091.47 1105.71 1156.60 1167.89 1177.47 1205.49 1209.90 1214.51 1225.11 1290.02 1301.77 1305.12 1319.78
formula: C5F11O3S
InChI: InChI=1/C5F11O3S/c6-1(7,4(11,12)13)3(10,20(17,18)19)2(8,9)5(14,15)16
20 atoms
C  -1.856825 0.205474 0.275378
C  -0.789005 0.453314 -0.834806
F  -1.314119 -0.321245 1.420567
F  -2.786753 -0.675463 -0.12849
C  -2.590046 1.49479 0.792155
C  0.478084 -0.437178 -0.671102
F  0.135212 -1.66816 -0.223187
C  1.591122 0.126488 0.286086
F  1.127367 -0.60219 -1.842373
F  1.12431 0.555711 1.461524
F  -0.364214 1.766996 -0.701717
F  -1.762902 2.22339 1.560782
F  -3.614654 1.099494 1.576003
F  -3.077428 2.27375 -0.157217
F  2.480013 -0.854363 0.536667
F  2.253917 1.133327 -0.290288
S  -1.532604 0.257055 -2.610998
O  -0.562172 0.975816 -3.409379
O  -2.829003 0.894262 -2.495571
O  -1.552491 -1.18463 -2.765106
totalener: -1912.43037054381443 hartree
nucrepener: 2446.42875194362705 hartree
electener: -4358.85912238395667 hartree
oneelecener: -7553.59418219185500 hartree
twoeener: 3194.73505980789832 hartree
kineticenergy: 1908.62356225694475 hartree
exchangeener: -148.927992075019 hartree
correlationener: -7.613547192687 hartree
xcener: -156.541539267706 hartree
s2: 0.000000
dispersion: -0.044969460 hartree
dispersion: -0.044034567 hartree
dispersion: -0.043342402 hartree
s2: -0.000000
dispersion: -0.042796333 hartree
dispersion: -0.042280950 hartree
dispersion: -0.041647012 hartree
dispersion: -0.041542638 hartree
dispersion: -0.041105591 hartree
dispersion: -0.041152361 hartree
dispersion: -0.041024707 hartree
dispersion: -0.041035401 hartree
dispersion: -0.041203170 hartree
dispersion: -0.041409797 hartree
dispersion: -0.041475433 hartree
dispersion: -0.041316051 hartree
dispersion: -0.041197493 hartree
dispersion: -0.041051734 hartree
dispersion: -0.041024575 hartree
dispersion: -0.041021772 hartree
dispersion: -0.041065061 hartree
dispersion: -0.041095252 hartree
dispersion: -0.041095974 hartree
dispersion: -0.041081574 hartree
dispersion: -0.041072515 hartree
dispersion: -0.041069756 hartree
dispersion: -0.041074559 hartree
dispersion: -0.041084623 hartree
dispersion: -0.041099556 hartree
dispersion: -0.041116503 hartree
dispersion: -0.041128282 hartree
dispersion: -0.041132843 hartree
dispersion: -0.041130089 hartree
dispersion: -0.041126893 hartree
dispersion: -0.041124414 hartree
dispersion: -0.041122957 hartree
energy: -2418.9099 -670.2218 -670.1698 -670.1336 -669.9870 -669.9835 -669.9307 -669.5920 -669.5307 -669.4857 -669.3808 -669.0166 -515.7673 -515.7624 -515.7601 -281.3732 -281.2466 -279.5375 -279.5369 -277.2067 -215.9413 -160.5840 -160.4700 -160.4664 -33.6181 -33.4395 -32.0801 -31.9231 -31.1867 -31.1018 -30.9958 -30.9124 -30.4389 -30.3427 -30.2510 -26.5270 -22.8717 -22.8545 -19.4169 -18.4914 -17.2612 -15.9065 -15.2208 -14.1286 -14.0612 -14.0342 -13.8684 -13.8305 -13.7233 -12.9939 -12.8144 -12.3027 -12.1374 -11.8555 -10.6350 -10.6009 -10.5084 -10.4739 -10.3758 -10.2511 -10.1321 -9.8412 -9.5991 -9.5569 -9.4887 -9.2791 -9.2430 -9.0676 -8.9493 -8.9075 -8.7595 -8.5652 -8.4817 -8.3001 -8.2466 -8.1589 -8.0778 -7.5110 -6.5652 -5.4415 -5.3837 -4.5992 -4.5070 -4.2158 -3.1841 3.4578 3.9398 4.6714 5.4341 5.5708 6.1851 6.2660 6.4939 6.6933 7.1444 7.5220 electronvolt
chargesum: -1.0000000
charge: 0.311402 0.029884 -0.200972 -0.157539 0.457248 0.329691 -0.182591 0.455113 -0.158700 -0.166765 -0.224279 -0.175737 -0.180165 -0.131104 -0.177080 -0.160028 0.842657 -0.503136 -0.508509 -0.499391
charge: -0.470684 -0.381196 0.171683 0.224406 -0.663383 -0.485483 0.203756 -0.657575 0.220428 0.212359 0.152597 0.195691 0.187842 0.247582 0.190832 0.212851 0.433661 -0.328791 -0.332961 -0.333616
qa: 0.3114 0.0299 -0.2010 -0.1575 0.4572 0.3297 -0.1826 0.4551 -0.1587 -0.1668 -0.2243 -0.1757 -0.1802 -0.1311 -0.1771 -0.1600 0.8427 -0.5031 -0.5085 -0.4994
va: 4.1668 3.6856 1.0816 1.1516 4.5283 4.1613 1.1157 4.5255 1.1532 1.1399 1.0479 1.1262 1.1244 1.1893 1.1281 1.1469 6.2116 1.9554 1.9411 1.9289
dispersion: -0.041122309 hartree
energy: -1912.811507866119 hartree
dipole: -2.714091767 3.668657512 0.954565745 -0.630065495 0.865863653 0.235798158 -7.787097749 10.618433015 2.831335265
dipolemethod: SCF
magnitude: 2.997208020 au
magnitude: 7.618297351 debye
temp: 298.15 k
press: 1.00 atm
zeropoint: 0.07581657 hartree
thermalvibcorrection: 0.01532823 hartree
thermalrotcorrection: 0.00141627 hartree
thermaltrasncorrection: 0.00141627 hartree
thermaltotal: -1912.71753052 hartree
thermalcorr: 0.01816077 hartree
nonthermalcorr: 0.07581657 hartree
totalcorr: 0.09397734 hartree
thermalcorrenthalpy: 0.00094421 hartree
totalenthalpy: -1912.71658632 hartree
vibrat: 0.02675615 hartree
rotat: 0.01590719 hartree
transl: 0.02064181 hartree
total: 0.06330515 hartree
totalentropycorr: -0.06330515 hartree
gibbsenthalpy: -1912.77989147 hartree
gibbsminuselec: 0.03161640 hartree
