program: Orca
programVersion: 6.0.0
elementType: C C F F C C F C F F F F F F F F S O O O
charge: -1
multiplicity: 1
keywords: DLPNO-CCSD(T) def2-TZVPP def2-TZVPP/C VeryTightSCF TightPNO
formula: C5F11O3S
InChI: InChI=1/C5F11O3S/c6-1(7,4(11,12)13)3(10,20(17,18)19)2(8,9)5(14,15)16
20 atoms
C  -1.856825 0.205474 0.275378
C  -0.789005 0.453314 -0.834806
F  -1.314119 -0.321245 1.420567
F  -2.786753 -0.675463 -0.12849
C  -2.590046 1.49479 0.792155
C  0.478084 -0.437178 -0.671102
F  0.135212 -1.66816 -0.223187
C  1.591122 0.126488 0.286086
F  1.127367 -0.60219 -1.842373
F  1.12431 0.555711 1.461524
F  -0.364214 1.766996 -0.701717
F  -1.762902 2.22339 1.560782
F  -3.614654 1.099494 1.576003
F  -3.077428 2.27375 -0.157217
F  2.480013 -0.854363 0.536667
F  2.253917 1.133327 -0.290288
S  -1.532604 0.257055 -2.610998
O  -0.562172 0.975816 -3.409379
O  -2.829003 0.894262 -2.495571
O  -1.552491 -1.18463 -2.765106
totalener: -1905.97989842765992 hartree
nucrepener: 2336.62067275870277 hartree
electener: -4242.60057118636269 hartree
oneelecener: -7330.74489455528874 hartree
twoeener: 3088.14432336892605 hartree
kineticenergy: 1904.23379093702692 hartree
s2: -0.000000
energy: -2504.3925 -714.5012 -714.4211 -714.3877 -714.2420 -714.2229 -714.1596 -713.8718 -713.8279 -713.7648 -713.6378 -713.3171 -554.8230 -554.8203 -554.7924 -311.0698 -310.9285 -309.1773 -309.1606 -306.7579 -244.8835 -181.9428 -181.9061 -181.9037 -44.9038 -44.7063 -43.3061 -43.1365 -42.2959 -42.1931 -42.0795 -41.9917 -41.6016 -41.4588 -41.3671 -36.1824 -32.1769 -32.1445 -27.4593 -26.1924 -24.6026 -22.8662 -21.9909 -20.5629 -20.4150 -20.3430 -20.2392 -20.1038 -20.0200 -19.2207 -18.9936 -18.3939 -18.2020 -17.8989 -17.1694 -17.0293 -16.9842 -16.9310 -16.8048 -16.7190 -16.4586 -16.2655 -16.1567 -16.0575 -15.7617 -15.6882 -15.4745 -15.4608 -15.3881 -15.1991 -15.0487 -14.9222 -14.7995 -13.9613 -13.8574 -13.7435 -13.6265 -12.8124 -11.5571 -10.3870 -10.2979 -9.2566 -9.1754 -8.3312 -7.8894 7.9592 8.4683 8.9330 9.2697 9.7383 10.3739 10.5449 10.8496 11.1888 11.7615 11.8730 electronvolt
chargesum: -1.0000000
charge: 0.469772 0.083646 -0.262558 -0.222141 0.629565 0.496242 -0.247522 0.621545 -0.220498 -0.234244 -0.281375 -0.241102 -0.244563 -0.200467 -0.241663 -0.226631 1.242725 -0.638997 -0.644601 -0.637132
charge: -0.372331 -0.318436 0.126569 0.179140 -0.528008 -0.387354 0.158346 -0.521985 0.174446 0.167754 0.105980 0.152025 0.143915 0.202328 0.147026 0.168861 0.584902 -0.391689 -0.394959 -0.396529
qa: 0.4698 0.0836 -0.2626 -0.2221 0.6296 0.4962 -0.2475 0.6215 -0.2205 -0.2342 -0.2814 -0.2411 -0.2446 -0.2005 -0.2417 -0.2266 1.2427 -0.6390 -0.6446 -0.6371
va: 4.1740 3.9092 0.9786 1.0473 4.2794 4.1399 1.0170 4.2748 1.0435 1.0356 0.9491 1.0256 1.0169 1.0805 1.0209 1.0446 6.0045 1.7925 1.7758 1.7764
corrType: DLPNO BASED
energy: -1910.532609989758 hartree
dipole: -2.714092181 3.711308635 0.997216454 -0.630065467 0.869154829 0.239089362 -7.787096780 10.760869935 2.973773156
dipolemethod: SCF
magnitude: 3.145620950 au
magnitude: 7.995533039 debye
