program: Orca
programVersion: 6.0.0
elementType: C C F F C C F C F F F F F F F F S O O O
charge: -1
multiplicity: 1
keywords: DLPNO-CCSD(T) def2-TZVPP def2-TZVPP/C VeryTightSCF TightPNO
formula: C5F11O3S
InChI: InChI=1/C5F10.FO3S/c6-1(2(7)4(10,11)12)3(8,9)5(13,14)15;1-5(2,3)4
20 atoms
C  -1.582588 0.339283 0.018446
C  -0.138439 0.552043 0.410407
F  -2.386147 0.477593 1.124095
F  -1.828028 -0.876869 -0.495721
C  -2.111642 1.386053 -1.010134
C  0.52878 -0.054719 1.384608
F  0.084015 -3.139184 -1.77065
C  0.026314 -1.067507 2.383642
F  1.782243 0.320062 1.639083
F  -0.978361 -1.809498 1.922307
F  0.482022 1.516968 -0.274684
F  -2.007547 2.631116 -0.513906
F  -3.415831 1.147244 -1.230539
F  -1.476049 1.326347 -2.170672
F  1.007298 -1.867042 2.797061
F  -0.434956 -0.418938 3.495742
S  1.331259 -2.12721 -1.454873
O  1.499591 -2.287931 -0.022271
O  0.796044 -0.842071 -1.862272
O  2.389466 -2.659562 -2.277029
totalener: -1905.98168800159192 hartree
nucrepener: 2218.27604316040515 hartree
electener: -4124.25773116199707 hartree
oneelecener: -7094.07898585006114 hartree
twoeener: 2969.82125468806407 hartree
kineticenergy: 1904.24577041427392 hartree
s2: -0.000000
energy: -2504.9265 -714.7604 -714.6820 -714.6121 -714.3126 -714.2522 -714.1512 -714.1454 -714.0667 -714.0520 -713.9936 -711.5120 -554.7645 -554.7462 -554.6774 -311.3572 -311.1074 -309.6324 -306.7939 -306.7263 -245.3072 -182.3938 -182.3269 -182.3255 -45.1533 -44.6191 -43.5274 -42.7380 -42.5510 -42.4589 -42.2585 -42.0616 -41.8321 -41.7707 -39.8742 -35.5248 -32.1297 -32.1098 -28.3274 -26.6702 -24.6314 -23.2414 -21.6060 -21.0140 -20.7133 -20.5569 -20.0502 -19.9594 -19.9342 -18.9801 -18.8304 -18.5681 -18.4391 -17.4706 -17.3413 -17.2624 -17.2241 -16.9053 -16.7520 -16.5798 -16.5268 -16.4283 -16.2073 -15.9730 -15.9359 -15.6551 -15.6355 -15.5336 -15.4216 -15.2979 -15.1661 -14.8775 -14.8386 -14.4513 -13.5652 -13.0872 -13.0533 -12.5759 -10.6219 -10.5372 -10.2600 -8.8885 -8.8717 -8.3143 -7.8911 5.8957 7.6301 8.5978 9.2226 9.8131 10.2057 10.4643 11.3007 11.5272 11.6444 11.6799 electronvolt
chargesum: -1.0000000
charge: 0.579067 0.138674 -0.259765 -0.213453 0.635316 0.271588 -0.369095 0.676019 -0.246180 -0.227388 -0.244257 -0.242127 -0.237545 -0.202767 -0.216360 -0.260852 1.419633 -0.671162 -0.673454 -0.655890
charge: -0.359259 -0.191508 0.126281 0.187866 -0.523174 -0.184737 -0.216838 -0.518264 0.186950 0.187801 0.185907 0.153783 0.155449 0.200764 0.185871 0.112266 0.538185 -0.409789 -0.410226 -0.407328
qa: 0.5791 0.1387 -0.2598 -0.2135 0.6353 0.2716 -0.3691 0.6760 -0.2462 -0.2274 -0.2443 -0.2421 -0.2375 -0.2028 -0.2164 -0.2609 1.4196 -0.6712 -0.6735 -0.6559
va: 4.0598 3.9916 0.9911 1.0544 4.2770 3.9634 0.8389 4.2827 1.0133 1.0443 0.9962 1.0288 1.0291 1.0838 1.0572 0.9853 6.0313 1.7261 1.7145 1.8204
corrType: DLPNO BASED
energy: -1910.525986378786 hartree
dipole: 5.730737902 -8.074986495 -2.344248594 -4.049872803 6.449366422 2.399493619 -3.889659399 5.883959176 1.994299777
dipolemethod: SCF
magnitude: 3.902602042 au
magnitude: 9.919626064 debye
