program: Orca
programVersion: 6.0.0
elementType: C C F F C C F C F F F F F F F F S O O O
charge: -1
multiplicity: 1
keywords: B3LYP D3BJ TightOpt Freq def2-TZVPP def2/J RIJCOSX VeryTightSCF defgrid3
frequency: 0.00 0.00 0.00 0.00 0.00 0.00 13.57 19.06 23.68 41.32 52.76 57.24 62.88 68.08 72.07 94.97 141.07 158.15 208.49 224.61 253.72 281.93 297.30 308.28 333.62 357.96 381.73 388.84 397.01 459.40 472.47 519.93 524.75 527.39 554.42 567.05 568.67 584.70 639.72 645.72 670.42 685.80 713.12 751.39 842.49 1018.00 1061.12 1086.67 1158.07 1179.72 1189.48 1193.57 1210.52 1232.16 1260.95 1289.03 1304.07 1321.03 1408.10 1784.33
frequency: 13.57 19.06 23.68 41.32 52.76 57.24 62.88 68.08 72.07 94.97 141.07 158.15 208.49 224.61 253.72 281.93 297.30 308.28 333.62 357.96 381.73 388.84 397.01 459.40 472.47 519.93 524.75 527.39 554.42 567.05 568.67 584.70 639.72 645.72 670.42 685.80 713.12 751.39 842.49 1018.00 1061.12 1086.67 1158.07 1179.72 1189.48 1193.57 1210.52 1232.16 1260.95 1289.03 1304.07 1321.03 1408.10 1784.33
formula: C5F11O3S
InChI: InChI=1/C5F10.FO3S/c6-1(2(7)4(10,11)12)3(8,9)5(13,14)15;1-5(2,3)4
20 atoms
C  -1.43868 0.26979 -0.743646
C  -0.0784 0.704593 -0.231498
F  -1.791189 -0.940758 -0.279769
F  -1.446215 0.258333 -2.090885
C  -2.563487 1.261804 -0.317357
C  0.386822 0.483216 0.99057
F  -0.329807 -0.196334 1.889185
C  1.689917 0.99196 1.553575
F  1.829805 -1.985851 0.4932
F  2.613507 1.206924 0.618772
F  0.590733 1.462253 -1.09453
F  -2.694388 1.301377 1.014397
F  -3.740311 0.898649 -0.841645
F  -2.279706 2.502331 -0.746069
F  1.487864 2.179545 2.19732
F  2.182086 0.147439 2.463509
S  1.449438 -2.566474 -1.014015
O  0.946435 -1.367503 -1.661954
O  0.459104 -3.571325 -0.709096
O  2.726483 -3.039968 -1.490062
totalener: -1912.77673521626070 hartree
nucrepener: 2190.55126005297734 hartree
electener: -4103.32798993011784 hartree
oneelecener: -7040.06025192943434 hartree
twoeener: 2936.73226199931605 hartree
kineticenergy: 1907.35939959694633 hartree
exchangeener: -148.808440159463 hartree
correlationener: -7.569282761686 hartree
xcener: -156.377722921149 hartree
s2: -0.000000
dispersion: -0.035430227 hartree
temp: 298.15 k
press: 1.00 atm
thermalcorrenthalpy: 0.00094421 hartree
totalenthalpy: -1912.72074997 hartree
vibrat: 0.02252472 hartree
rotat: 0.01619861 hartree
transl: 0.02064181 hartree
total: 0.05936513 hartree
totalentropycorr: -0.05936513 hartree
gibbsenthalpy: -1912.78011511 hartree
gibbsminuselec: 0.03205034 hartree
s2: 0.000000
dispersion: -0.035544340 hartree
dispersion: -0.035541025 hartree
dispersion: -0.035625180 hartree
dispersion: -0.035776659 hartree
dispersion: -0.035771547 hartree
dispersion: -0.035756609 hartree
dispersion: -0.035756243 hartree
dispersion: -0.035767822 hartree
dispersion: -0.035769242 hartree
dispersion: -0.035769038 hartree
energy: -2419.2766 -670.7789 -670.7693 -670.7503 -670.1741 -670.1251 -670.0797 -670.0684 -670.0436 -669.9613 -669.9373 -667.1623 -515.6469 -515.5544 -515.5404 -281.8633 -281.5506 -280.0715 -277.5926 -277.4474 -216.2232 -160.9272 -160.7339 -160.7241 -34.1623 -33.5072 -32.4745 -31.7616 -31.7333 -31.6372 -31.6140 -31.1273 -30.9423 -30.8162 -28.7197 -25.6681 -22.7426 -22.7262 -20.3812 -19.1160 -17.5992 -16.4035 -15.3093 -14.6092 -14.5650 -14.5171 -14.0189 -13.9365 -13.9008 -13.2936 -13.0108 -12.4041 -12.2777 -11.2753 -11.1391 -11.1205 -10.8811 -10.6543 -10.4970 -10.3960 -10.1994 -10.1023 -10.0315 -9.8499 -9.7168 -9.5951 -9.5196 -9.4219 -9.3349 -9.2531 -8.9809 -8.8846 -8.6676 -8.6085 -8.2345 -7.3331 -7.2500 -7.1450 -5.7462 -5.3668 -5.2554 -4.9944 -4.0339 -3.9772 -3.0279 1.5941 3.1264 4.5552 4.9683 5.2458 5.7187 6.3081 6.3626 6.9325 7.1181 7.1654 electronvolt
chargesum: -1.0000000
charge: 0.378512 0.152091 -0.156638 -0.164372 0.460602 0.149488 -0.184031 0.482721 -0.322864 -0.153486 -0.174297 -0.166809 -0.166471 -0.173349 -0.197213 -0.157834 0.962156 -0.534187 -0.514534 -0.519483
charge: -0.481192 -0.251008 0.236650 0.225220 -0.651436 -0.254539 0.230765 -0.646874 -0.191496 0.230417 0.245271 0.212688 0.208738 0.203548 0.158427 0.221072 0.355160 -0.343493 -0.355046 -0.352872
qa: 0.3785 0.1521 -0.1566 -0.1644 0.4606 0.1495 -0.1840 0.4827 -0.3229 -0.1535 -0.1743 -0.1668 -0.1665 -0.1733 -0.1972 -0.1578 0.9622 -0.5342 -0.5145 -0.5195
va: 4.2133 3.7860 1.1644 1.1540 4.5135 3.7918 1.1215 4.5508 0.9197 1.1589 1.1320 1.1442 1.1474 1.1333 1.0912 1.1573 6.3121 1.8673 1.9158 1.9591
dispersion: -0.035770347 hartree
energy: -1912.813305948645 hartree
dipole: 3.932750921 -6.049646816 -2.116895894 -7.411185396 11.035513575 3.624328178 -3.688518135 5.068578947 1.380060812
dipolemethod: SCF
magnitude: 4.418322172 au
magnitude: 11.230482460 debye
zeropoint: 0.07441088 hartree
thermalvibcorrection: 0.01702815 hartree
thermalrotcorrection: 0.00141627 hartree
thermaltrasncorrection: 0.00141627 hartree
thermaltotal: -1912.71903437 hartree
thermalcorr: 0.01986069 hartree
nonthermalcorr: 0.07441088 hartree
totalcorr: 0.09427158 hartree
totalenthalpy: -1912.71809016 hartree
vibrat: 0.03172164 hartree
rotat: 0.01618739 hartree
total: 0.06855083 hartree
