program: Orca
programVersion: 6.0.0
elementType: C C F F C C F C F F F F F F F F S O O O
charge: -1
multiplicity: 1
keywords: DLPNO-CCSD(T) def2-TZVPP def2-TZVPP/C VeryTightSCF TightPNO
formula: C5F11O3S
InChI: InChI=1/C5F10.F.O3S/c6-1(3(9,10)2(7)8)4(11,12)5(13,14)15;;1-4(2)3
20 atoms
C  -1.974039 0.703433 -0.060962
C  -0.585967 0.571898 -0.567171
F  -2.131119 0.180354 1.17188
F  -2.856382 0.004439 -0.881566
C  -2.54159 2.156956 -0.042519
C  0.307022 -0.594808 -0.385896
F  -0.399802 -1.648414 0.081182
C  1.468444 -0.354821 0.615501
F  0.859087 -0.912217 -1.589263
F  0.4022 1.309896 1.143231
F  -0.160311 1.517265 -1.403557
F  -1.805492 2.991337 0.678209
F  -3.780015 2.129444 0.486455
F  -2.647868 2.645156 -1.289399
F  1.395446 -0.749754 1.847131
F  2.472928 0.4073 0.306727
S  2.875335 -2.445952 -0.001882
O  3.623803 -1.94311 -1.139508
O  1.915541 -3.50699 -0.247483
O  3.56278 -2.461411 1.278892
totalener: -1905.69167717226674 hartree
nucrepener: 2190.67259013771172 hartree
electener: -4096.36426730997846 hartree
oneelecener: -7037.53562072701334 hartree
twoeener: 2941.17135341703488 hartree
kineticenergy: 1903.84049952914347 hartree
s2: 0.000000
energy: -2504.7175 -715.7051 -715.2286 -715.1217 -715.0236 -714.8989 -714.8708 -713.9609 -713.7409 -713.6596 -713.5416 -708.9208 -555.7581 -555.7400 -555.7373 -311.9222 -310.5026 -309.6185 -309.4830 -308.9143 -245.2880 -182.3410 -182.2807 -182.2804 -45.5992 -44.2121 -43.9873 -43.4371 -43.0364 -42.9854 -42.8563 -42.3226 -41.7438 -41.4657 -36.5516 -35.9042 -32.7547 -32.7241 -28.7822 -26.8786 -24.7959 -23.2018 -21.9510 -21.4192 -21.0639 -20.9944 -20.2840 -19.9544 -19.7357 -19.3398 -19.1298 -18.4430 -18.2611 -18.0553 -17.8972 -17.7513 -17.6616 -17.5903 -17.3229 -17.0374 -16.5172 -16.4686 -16.4188 -16.0977 -16.0622 -16.0277 -15.8775 -15.7136 -15.2473 -15.1228 -14.8712 -14.3062 -14.3038 -14.1233 -13.8018 -12.7137 -11.3665 -11.1848 -10.9137 -10.8786 -10.7686 -9.7301 -9.6774 -8.6722 -3.9459 1.9577 6.6657 7.4214 8.3400 8.9651 9.3868 9.7147 9.9201 10.9851 11.0892 11.2400 electronvolt
chargesum: -1.0000000
charge: 0.502718 0.395988 -0.208073 -0.245498 0.631380 0.468988 -0.233418 0.333122 -0.233225 -0.652746 -0.187152 -0.195488 -0.233003 -0.235065 -0.177549 -0.188203 1.192889 -0.574051 -0.578367 -0.583246
charge: -0.349012 -0.006376 0.190306 0.114965 -0.519436 -0.468356 0.174853 -0.465260 0.156231 -0.473489 0.225714 0.201382 0.154650 0.158039 0.219102 0.214240 0.631454 -0.386698 -0.388165 -0.384146
qa: 0.5027 0.3960 -0.2081 -0.2455 0.6314 0.4690 -0.2334 0.3331 -0.2332 -0.6527 -0.1872 -0.1955 -0.2330 -0.2351 -0.1775 -0.1882 1.1929 -0.5741 -0.5784 -0.5832
va: 4.1856 3.9989 1.0718 1.0116 4.2925 4.0475 1.0250 4.0598 1.0168 0.5517 1.1078 1.0956 1.0345 1.0367 1.0426 1.0369 5.7336 1.7718 1.7760 1.7997
corrType: DLPNO BASED
energy: -1910.320300237665 hartree
dipole: 9.043695129 -12.594805614 -3.551110485 -8.087834120 10.307313787 2.219479668 -0.413524355 -0.484955542 -0.898479897
dipolemethod: SCF
magnitude: 4.282959467 au
magnitude: 10.886417807 debye
