program: Orca
programVersion: 6.0.0
elementType: C C F F C C F C F F F F F F F F S O O O
charge: -1
multiplicity: 1
keywords: DLPNO-CCSD(T) def2-TZVPP def2-TZVPP/C VeryTightSCF TightPNO
formula: C5F11O3S
InChI: InChI=1/C5F11.O3S/c6-1(2(7,8)4(11,12)13)3(9,10)5(14,15)16;1-4(2)3
20 atoms
C  -1.690759 0.484735 -0.200548
C  -0.319541 0.826059 0.094399
F  -2.213677 -0.406451 0.704851
F  -1.979199 -0.166439 -1.466019
C  -2.661536 1.698803 -0.248502
C  0.716841 -0.1981 -0.007432
F  0.301281 -1.385674 0.552149
C  2.045631 0.154398 0.732731
F  1.124762 -0.528098 -1.263744
F  1.856318 0.285626 2.051788
F  0.091747 1.974176 -0.637163
F  -2.556063 2.475613 0.842599
F  -3.94138 1.266119 -0.294812
F  -2.474596 2.476989 -1.324033
F  2.961468 -0.833085 0.564644
F  2.601914 1.285335 0.277085
S  1.87011 -3.399406 -1.543026
O  2.911437 -2.878995 -2.370009
O  0.573079 -3.626579 -2.090308
O  2.163018 -3.801316 -0.206067
totalener: -1905.88972066162842 hartree
nucrepener: 2129.86529647053521 hartree
electener: -4035.75501713216363 hartree
oneelecener: -6918.24142519286397 hartree
twoeener: 2882.48640806070034 hartree
kineticenergy: 1904.21230915756951 hartree
energy: -2507.7616 -713.5609 -713.5597 -713.5212 -713.3588 -713.3510 -713.3459 -712.8301 -712.8144 -712.3890 -711.5003 -710.9394 -559.0294 -559.0246 -559.0216 -309.9687 -309.8806 -307.6654 -307.3693 -302.2568 -248.4205 -185.5145 -185.3875 -185.3873 -43.9147 -43.7150 -42.1983 -41.3434 -41.2488 -41.2110 -41.1243 -40.9773 -40.4149 -39.9937 -39.0642 -38.8441 -36.1016 -36.0945 -26.1499 -25.1940 -23.2420 -21.8107 -20.6818 -20.5582 -19.3598 -19.3339 -19.2463 -19.1055 -18.9669 -18.4913 -17.7320 -17.4995 -17.3456 -17.3341 -17.1900 -16.5723 -16.2720 -16.1530 -16.0315 -15.9937 -15.8672 -15.6595 -15.3904 -15.1775 -14.9096 -14.8134 -14.7634 -14.6518 -14.5515 -14.3722 -14.1776 -14.1357 -13.9560 -13.9402 -13.8926 -13.6570 -13.1944 -13.0127 -12.6253 -12.5967 -12.5215 -11.9431 -11.7121 -10.2854 -4.8422 4.5951 5.1121 9.1042 9.5511 9.8543 9.9706 10.4350 10.6713 11.1304 11.3137 11.6518 electronvolt
chargesum: -1.0000000
charge: 0.513979 -0.249488 -0.272696 -0.339718 0.641976 0.524844 -0.287410 0.656789 -0.313041 -0.244535 -0.358723 -0.247795 -0.257924 -0.243579 -0.264970 -0.242922 1.356989 -0.466775 -0.451650 -0.453352
charge: -0.361114 -0.380137 0.113022 -0.013782 -0.497760 -0.430551 0.114855 -0.503124 0.109449 0.156835 0.000924 0.150180 0.130303 0.153471 0.119916 0.156379 0.772827 -0.271074 -0.258670 -0.261948
qa: 0.5140 -0.2495 -0.2727 -0.3397 0.6420 0.5248 -0.2874 0.6568 -0.3130 -0.2445 -0.3587 -0.2478 -0.2579 -0.2436 -0.2650 -0.2429 1.3570 -0.4668 -0.4517 -0.4534
va: 4.0930 3.0677 0.9577 0.8858 4.2321 4.0322 0.9572 4.2202 0.9124 1.0252 0.8137 1.0167 0.9973 1.0217 0.9849 1.0268 5.6893 1.9731 1.9928 1.9844
e0: -1905.889720662 hartree
corrType: DLPNO BASED
energy: -1910.446993475542 hartree
dipole: 5.318235466 -4.391974863 0.926260603 -9.401495214 8.147447556 -1.254047659 -3.515772390 3.276924848 -0.238847542
dipolemethod: SCF
magnitude: 1.577226167 au
magnitude: 4.008990317 debye
