program: Orca
programVersion: 6.0.0
elementType: C C F F C C F C F F F F F F F F S O O O
charge: -1
multiplicity: 1
keywords: B3LYP D3BJ TightOpt Freq def2-TZVPP def2/J RIJCOSX VeryTightSCF defgrid3
frequency: 0.00 0.00 0.00 0.00 0.00 0.00 31.66 48.61 64.03 69.97 96.06 125.23 143.51 160.14 181.07 191.21 221.23 229.24 249.31 256.37 267.25 289.08 292.15 311.16 314.72 326.20 358.31 380.19 397.64 468.85 504.81 523.33 525.44 537.62 545.20 581.09 595.20 608.48 623.26 687.36 706.58 742.77 814.41 896.66 999.42 1051.06 1073.65 1097.73 1121.91 1145.37 1162.16 1185.62 1199.42 1213.82 1219.46 1243.49 1276.50 1299.24 1304.77 1334.65
frequency: 31.66 48.61 64.03 69.97 96.06 125.23 143.51 160.14 181.07 191.21 221.23 229.24 249.31 256.37 267.25 289.08 292.15 311.16 314.72 326.20 358.31 380.19 397.64 468.85 504.81 523.33 525.44 537.62 545.20 581.09 595.20 608.48 623.26 687.36 706.58 742.77 814.41 896.66 999.42 1051.06 1073.65 1097.73 1121.91 1145.37 1162.16 1185.62 1199.42 1213.82 1219.46 1243.49 1276.50 1299.24 1304.77 1334.65
formula: C5F11O3S
InChI: InChI=1/C5F11O3S/c6-1(7,2(8,9)4(11,12)13)3(10,5(14,15)16)20(17,18)19
20 atoms
C  1.043521 -0.051617 -0.357694
C  -0.246486 -0.606946 0.305704
F  -3.041476 0.529709 1.068165
F  0.881406 -0.172654 -1.7247
C  2.271577 -0.929432 -0.005597
C  -1.557498 -0.43541 -0.552547
F  -1.619219 0.724537 -1.211447
C  -2.86723 -0.53738 0.293268
F  -1.608316 -1.442064 -1.461576
F  -0.438459 -0.059793 1.52255
F  -0.154935 -1.959503 0.514406
F  2.344212 -1.186268 1.30699
F  3.416264 -0.360762 -0.388424
F  2.211593 -2.123492 -0.646699
F  -3.91673 -0.61487 -0.545173
F  -2.877161 -1.63564 1.060026
S  1.379611 1.80032 0.071593
O  2.051456 1.68994 1.352284
O  0.053996 2.385684 0.113573
O  2.203447 2.205199 -1.047914
totalener: -1912.77384443741516 hartree
nucrepener: 2316.37070734651161 hartree
electener: -4229.14454762274818 hartree
oneelecener: -7292.50384150067839 hartree
twoeener: 3063.35929387793021 hartree
kineticenergy: 1907.04920129500124 hartree
exchangeener: -148.749427925778 hartree
correlationener: -7.578981392594 hartree
xcener: -156.328409318372 hartree
s2: 0.000000
dispersion: -0.040671409 hartree
temp: 298.15 k
press: 1.00 atm
thermalcorrenthalpy: 0.00094421 hartree
totalenthalpy: -1912.71952004 hartree
vibrat: 0.02699300 hartree
rotat: 0.01593960 hartree
transl: 0.02064181 hartree
total: 0.06357441 hartree
totalentropycorr: -0.06357441 hartree
gibbsenthalpy: -1912.78309445 hartree
gibbsminuselec: 0.03142139 hartree
s2: -0.000000
dispersion: -0.040679687 hartree
energy: -2418.8851 -670.5432 -670.4962 -670.4599 -670.0006 -669.9053 -669.6070 -669.5798 -669.5343 -669.4437 -669.4195 -668.9076 -515.7335 -515.7308 -515.7264 -281.7232 -280.7788 -279.9216 -279.5991 -277.1011 -215.9147 -160.5570 -160.4440 -160.4403 -33.9487 -32.8758 -32.5511 -32.0373 -31.5274 -31.4158 -30.8466 -30.5358 -30.4327 -30.2960 -30.2302 -26.4981 -22.8309 -22.8300 -19.5604 -18.7500 -17.1846 -15.9838 -15.1722 -14.4160 -14.3814 -14.3511 -13.6082 -13.4992 -13.3524 -13.2431 -12.8787 -12.5601 -12.2336 -11.7782 -10.9546 -10.9167 -10.7710 -10.4326 -10.1501 -10.1052 -9.9910 -9.8292 -9.8000 -9.7331 -9.4730 -9.2996 -9.2177 -9.1635 -8.9427 -8.7496 -8.6954 -8.6050 -8.5650 -8.3087 -8.2336 -8.1518 -8.0887 -7.6481 -6.4934 -5.4130 -5.3804 -4.5395 -4.4862 -4.2229 -3.1564 3.4218 3.7324 4.8264 5.3544 5.4904 5.9732 6.2185 6.8561 6.9529 7.1667 7.3600 electronvolt
chargesum: -1.0000000
charge: 0.093070 0.273929 -0.147336 -0.217614 0.459011 0.337822 -0.142460 0.446311 -0.184296 -0.168068 -0.199395 -0.169058 -0.157040 -0.193013 -0.174199 -0.167597 0.831166 -0.502459 -0.513890 -0.504884
charge: -0.394939 -0.460523 0.230020 0.156525 -0.676054 -0.469232 0.246032 -0.660093 0.195331 0.220677 0.176722 0.209316 0.220055 0.170777 0.196287 0.208837 0.431329 -0.335116 -0.336623 -0.329327
qa: 0.0931 0.2739 -0.1473 -0.2176 0.4590 0.3378 -0.1425 0.4463 -0.1843 -0.1681 -0.1994 -0.1691 -0.1570 -0.1930 -0.1742 -0.1676 0.8312 -0.5025 -0.5139 -0.5049
va: 3.7116 4.1536 1.1700 1.0624 4.5636 4.1280 1.1797 4.5418 1.1201 1.1399 1.0940 1.1358 1.1578 1.1016 1.1332 1.1421 6.2155 1.9263 1.9303 1.9544
dispersion: -0.040679722 hartree
energy: -1912.814516063145 hartree
dipole: 4.638062973 -6.668188001 -2.030125029 6.849883127 -9.289237780 -2.439354652 0.343548689 -0.382743160 -0.039194472
dipolemethod: SCF
magnitude: 3.173861207 au
magnitude: 8.067314067 debye
zeropoint: 0.07584847 hartree
thermalvibcorrection: 0.01538372 hartree
thermalrotcorrection: 0.00141627 hartree
thermaltrasncorrection: 0.00141627 hartree
thermaltotal: -1912.72045133 hartree
thermalcorr: 0.01821626 hartree
nonthermalcorr: 0.07584847 hartree
totalcorr: 0.09406473 hartree
totalenthalpy: -1912.71950712 hartree
vibrat: 0.02699498 hartree
rotat: 0.01593926 hartree
total: 0.06357605 hartree
