program: Orca
programVersion: 6.0.0
elementType: C C F F C C F C F F F F F F F F S O O O
charge: -1
multiplicity: 1
keywords: DLPNO-CCSD(T) def2-TZVPP def2-TZVPP/C VeryTightSCF TightPNO
formula: C5F11O3S
InChI: InChI=1/C5F10.FO3S/c6-1(5(13,14)15)2(7,8)4(11,12)3(1,9)10;1-5(2,3)4
20 atoms
C  1.036784 0.481658 -0.512557
C  2.448086 0.338601 0.164965
F  -3.493235 1.104179 0.463914
F  1.219237 0.613066 -1.858548
C  0.164762 1.656356 -0.022985
C  2.317767 -1.213527 0.108781
F  2.984306 -1.737054 -0.93845
C  0.777317 -1.045955 -0.171804
F  2.659846 -1.877432 1.2208
F  2.473923 0.780502 1.43778
F  3.474279 0.874202 -0.508268
F  -0.347465 1.435373 1.179526
F  -0.784458 1.963847 -0.885181
F  0.983932 2.746739 0.071995
F  0.328613 -1.786593 -1.177007
F  0.083668 -1.257016 0.943223
S  -3.260141 -0.497381 0.161168
O  -4.507674 -0.882507 -0.456859
O  -3.008968 -1.026692 1.482782
O  -2.110618 -0.466759 -0.725703
totalener: -1905.96878774060224 hartree
nucrepener: 2230.04968385444045 hartree
electener: -4136.01847159504268 hartree
oneelecener: -7116.62640389222815 hartree
twoeener: 2980.60793229718547 hartree
kineticenergy: 1904.22001942606244 hartree
s2: -0.000000
energy: -2504.6618 -715.0056 -714.9974 -714.9445 -714.9261 -714.5023 -714.3953 -714.3715 -714.2737 -714.2383 -714.2347 -711.2227 -554.5154 -554.4422 -554.4389 -311.2417 -309.7941 -309.6105 -309.5521 -307.8783 -245.0423 -182.1297 -182.0614 -182.0591 -44.8431 -44.6100 -44.1565 -43.6977 -42.9340 -42.6974 -42.5191 -42.2549 -42.0599 -42.0266 -39.5336 -35.2565 -31.8632 -31.8301 -30.2936 -26.1753 -24.3352 -23.5345 -21.9706 -21.2718 -20.7896 -20.6342 -20.2901 -20.1165 -19.7493 -19.6369 -19.3343 -19.0664 -18.6072 -18.5471 -17.7092 -17.5405 -17.3435 -17.2180 -16.9510 -16.8836 -16.8273 -16.6855 -16.5282 -16.3463 -16.1872 -15.9955 -15.7042 -15.6597 -15.4135 -15.3619 -15.2403 -14.9128 -14.5845 -14.5486 -13.1570 -12.8169 -12.7751 -12.1863 -11.2158 -10.3086 -10.0719 -10.0095 -8.6451 -8.5583 -7.5987 6.2340 7.4131 8.5663 9.1803 9.8840 9.9500 10.6454 11.1446 11.3248 11.4621 11.6527 electronvolt
chargesum: -1.0000000
charge: 0.278151 0.403430 -0.380028 -0.248569 0.652925 0.523488 -0.243527 0.423464 -0.244572 -0.238094 -0.245782 -0.214065 -0.193191 -0.261024 -0.219571 -0.199881 1.409257 -0.664456 -0.655502 -0.682452
charge: -0.188517 -0.352401 -0.231133 0.157319 -0.531812 -0.348399 0.158872 -0.375662 0.163110 0.165635 0.165454 0.200625 0.213806 0.119554 0.198702 0.207808 0.535520 -0.416794 -0.419824 -0.421864
qa: 0.2782 0.4034 -0.3800 -0.2486 0.6529 0.5235 -0.2435 0.4235 -0.2446 -0.2381 -0.2458 -0.2141 -0.1932 -0.2610 -0.2196 -0.1999 1.4093 -0.6645 -0.6555 -0.6825
va: 4.0101 4.2324 0.8208 1.0261 4.2756 4.1078 1.0371 4.2326 1.0393 1.0416 1.0341 1.0750 1.0852 0.9943 1.0665 1.0909 6.0566 1.8026 1.7575 1.6941
corrType: DLPNO BASED
energy: -1910.512037397780 hartree
dipole: -8.795021502 13.920686643 5.125665141 -2.583590205 3.329964877 0.746374672 0.157318130 -0.332762755 -0.175444625
dipolemethod: SCF
magnitude: 5.182692264 au
magnitude: 13.173356832 debye
