program: Orca
programVersion: 6.0.0
elementType: C C F F C C F C F F F F F F F F S O O O
charge: -1
multiplicity: 3
keywords: DLPNO-CCSD(T) def2-TZVPP def2-TZVPP/C VeryTightSCF TightPNO
formula: C5F11O3S
InChI: InChI=1/C5F10.F.O3S/c6-1(5(13,14)15)3(9,10)4(11,12)2(7)8;;1-4(2)3
20 atoms
C  0.937243 -0.549926 -0.394489
C  -0.189569 -1.251173 0.294732
F  -1.105389 1.396243 0.132551
F  0.701817 -0.049555 -1.599653
C  2.371308 -0.895183 -0.146762
C  -1.582804 -1.157221 -0.416588
F  -1.47916 -1.845307 -1.593607
C  -2.128463 0.249046 -0.671466
F  -2.448142 -1.834675 0.378024
F  -0.327274 -0.843251 1.572751
F  0.097416 -2.602799 0.366732
F  2.591073 -1.1558 1.14505
F  3.194243 0.071023 -0.55449
F  2.732489 -2.018678 -0.84419
F  -2.080898 0.607634 -1.947413
F  -3.350047 0.436658 -0.18665
S  0.35877 2.741564 1.030255
O  1.486522 1.809711 1.062743
O  -0.229538 3.074686 2.319162
O  0.450403 3.817004 0.053309
totalener: -1905.80629811671452 hartree
nucrepener: 2221.06092912026952 hartree
electener: -4126.86722723698404 hartree
oneelecener: -7099.48955616393596 hartree
twoeener: 2972.62232892695192 hartree
kineticenergy: 1904.28546835773022 hartree
s2: 2.211990
energy: -2503.5757 -714.6154 -714.6105 -714.6016 -714.5974 -714.5596 -714.3542 -714.2060 -714.1895 -714.1807 -714.1538 -712.8029 -554.9433 -554.8841 -554.8811 -311.0745 -309.9144 -309.8187 -309.6099 -307.1702 -244.2261 -181.3939 -181.1652 -181.1633 -44.6270 -44.4432 -43.9105 -43.3791 -43.1760 -42.4878 -42.1232 -42.1095 -41.8816 -41.7545 -38.6986 -35.8391 -32.1473 -32.1186 -28.5018 -27.0848 -24.8707 -23.1467 -22.0456 -20.9548 -20.5706 -20.3669 -20.1547 -19.9833 -19.8719 -19.3252 -19.2385 -18.8697 -18.6973 -18.0769 -18.0314 -17.4287 -17.2718 -17.2053 -16.9665 -16.8581 -16.7002 -16.3963 -16.2703 -15.9356 -15.7429 -15.6340 -15.6051 -15.5493 -15.4467 -15.3408 -15.1901 -14.7266 -14.5087 -14.4604 -13.9165 -13.6876 -13.6293 -12.3962 -11.5730 -10.4721 -10.4508 -9.9318 -9.2772 -8.8964 -7.9376 -4.3546 6.2913 7.6114 8.2864 9.0525 9.1787 9.9441 10.4266 10.8397 10.9856 11.3989 11.5140 electronvolt
energy: -2503.4723 -714.6031 -714.5753 -714.5519 -714.5046 -714.4742 -714.3547 -714.1831 -714.1470 -714.1266 -714.1219 -713.2957 -554.7357 -554.6845 -554.6835 -311.1481 -309.8212 -309.6831 -309.2731 -306.3865 -244.0898 -181.1302 -181.1284 -180.9785 -44.5695 -44.2850 -43.7638 -43.2729 -42.8478 -42.3748 -42.1033 -42.0189 -41.7544 -41.6211 -40.1809 -35.3186 -31.5275 -31.5137 -27.7928 -26.1953 -24.5264 -22.7757 -21.7132 -20.7923 -20.4210 -20.2420 -19.9032 -19.8024 -19.7230 -19.0909 -18.9006 -18.7068 -18.4559 -17.3633 -17.2099 -17.0655 -16.9536 -16.8967 -16.8197 -16.7775 -16.3673 -16.2360 -16.0716 -16.0166 -15.8795 -15.6080 -15.5338 -15.4878 -15.4102 -15.1585 -15.1556 -14.9924 -14.7536 -14.6743 -13.5869 -13.3259 -13.2699 -12.2129 -12.0791 -9.8861 -9.8445 -8.5492 -8.3961 -7.7326 5.0826 6.7189 7.7703 8.0515 9.0160 9.2581 9.4944 10.3261 10.8179 11.1078 11.3570 electronvolt
chargesum: -1.0000000
charge: 0.263866 0.505283 -0.289840 -0.242740 0.659236 0.449081 -0.249561 0.516376 -0.235984 -0.222660 -0.261751 -0.231516 -0.216218 -0.263755 -0.225509 -0.226315 1.211072 -0.663050 -0.637716 -0.638300
charge: -0.122913 -0.366799 -0.126764 0.193229 -0.531369 -0.354307 0.137280 -0.375997 0.156690 0.178064 0.114490 0.178876 0.184609 0.107188 0.175067 0.171255 0.583807 -0.434781 -0.433074 -0.434551
qa: 0.2639 0.5053 -0.2898 -0.2427 0.6592 0.4491 -0.2496 0.5164 -0.2360 -0.2227 -0.2618 -0.2315 -0.2162 -0.2638 -0.2255 -0.2263 1.2111 -0.6631 -0.6377 -0.6383
va: 3.9116 4.1546 0.8964 1.0345 4.2844 4.1685 1.0189 4.0977 1.0292 1.0512 0.9895 1.0460 1.0605 0.9910 1.0462 1.0399 5.6580 1.6946 1.7592 1.7572
corrType: DLPNO BASED
energy: -1910.350249524319 hartree
dipole: 1.488436588 -2.198047737 -0.709611149 8.329321512 -11.939172756 -3.609851244 3.285658612 -4.822342642 -1.536684030
dipolemethod: SCF
magnitude: 3.986975269 au
magnitude: 10.134085764 debye
