program: Orca
programVersion: 6.0.0
elementType: C C F F C C F C F F F F F F F F S O O O
charge: -1
multiplicity: 3
keywords: B3LYP D3BJ OptTS Freq def2-TZVPP def2/J RIJCOSX VeryTightSCF defgrid3
frequency: 0.00 0.00 0.00 0.00 0.00 0.00 -603.24 11.28 16.78 21.87 30.00 31.25 40.88 64.75 77.56 113.81 116.01 131.75 166.82 171.52 207.63 227.54 236.59 265.81 285.74 302.31 317.80 320.71 357.66 383.62 424.01 456.71 496.24 496.82 515.14 531.30 545.89 561.61 579.92 589.49 618.12 690.77 724.39 750.70 821.53 980.34 1024.27 1035.27 1099.53 1113.41 1128.49 1164.47 1169.19 1212.22 1236.06 1250.50 1253.35 1262.54 1321.64 1360.80
frequency: 11.28 16.78 21.87 30.00 31.25 40.88 64.75 77.56 113.81 116.01 131.75 166.82 171.52 207.63 227.54 236.59 265.81 285.74 302.31 317.80 320.71 357.66 383.62 424.01 456.71 496.24 496.82 515.14 531.30 545.89 561.61 579.92 589.49 618.12 690.77 724.39 750.70 821.53 980.34 1024.27 1035.27 1099.53 1113.41 1128.49 1164.47 1169.19 1212.22 1236.06 1250.50 1253.35 1262.54 1321.64 1360.80
formula: C5F11O3S
InChI: InChI=1/C5F11.O3S/c6-1(3(9,10)11)2(7,8)4(12,13)5(14,15)16;1-4(2)3
20 atoms
C  0.955912 -1.454344 -0.792703
C  -0.18672 -0.967319 -0.034742
F  -2.101722 1.523669 -0.129507
F  0.85695 -2.687143 -1.334637
C  2.360741 -0.91832 -0.752771
C  -1.448722 -0.674747 -0.816168
F  -1.124131 -0.119791 -2.009183
C  -2.498382 0.262023 -0.140476
F  -2.109735 -1.853827 -1.082528
F  0.284535 0.472893 0.617503
F  -0.467944 -1.717563 1.062951
F  2.424859 0.356181 -1.143662
F  3.147953 -1.640344 -1.585482
F  2.904454 -1.00521 0.475272
F  -3.648495 0.19839 -0.849333
F  -2.765598 -0.138165 1.104488
S  0.809181 2.41612 1.751108
O  2.118992 2.087042 2.300032
O  -0.296603 2.477209 2.699278
O  0.784476 3.383246 0.66056
totalener: -1912.64350990411731 hartree
nucrepener: 2169.72918003258837 hartree
electener: -4082.37268957244078 hartree
oneelecener: -6999.05759904042861 hartree
twoeener: 2916.68490946798784 hartree
kineticenergy: 1906.98179584782974 hartree
exchangeener: -148.657887893067 hartree
correlationener: -7.548794876082 hartree
xcener: -156.206682769149 hartree
s2: 2.009259
dispersion: -0.033387699 hartree
temp: 298.15 k
press: 1.00 atm
thermalcorrenthalpy: 0.00094421 hartree
totalenthalpy: -1912.58738177 hartree
vibrat: 0.03079749 hartree
rotat: 0.01621572 hartree
transl: 0.02064181 hartree
total: 0.06869231 hartree
totalentropycorr: -0.06869231 hartree
gibbsenthalpy: -1912.65607408 hartree
gibbsminuselec: 0.02082352 hartree
s2: 2.009255
dispersion: -0.033299947 hartree
s2: 2.009211
dispersion: -0.033219704 hartree
s2: 2.009189
dispersion: -0.033192654 hartree
s2: 2.009178
dispersion: -0.033182266 hartree
s2: 2.009168
dispersion: -0.033175462 hartree
s2: 2.009157
dispersion: -0.033170876 hartree
s2: 2.009146
dispersion: -0.033168315 hartree
s2: 2.009133
dispersion: -0.033166702 hartree
s2: 2.009119
dispersion: -0.033166643 hartree
s2: 2.009104
dispersion: -0.033169854 hartree
s2: 2.009089
dispersion: -0.033174866 hartree
s2: 2.009031
dispersion: -0.033181376 hartree
s2: 2.009097
dispersion: -0.033184144 hartree
s2: 2.009348
dispersion: -0.033161817 hartree
s2: 2.009241
dispersion: -0.033131472 hartree
s2: 2.009282
dispersion: -0.033127787 hartree
s2: 2.009250
dispersion: -0.033138954 hartree
s2: 2.009165
dispersion: -0.033132616 hartree
s2: 2.009142
dispersion: -0.033135973 hartree
s2: 2.009122
dispersion: -0.033141012 hartree
totalenthalpy: -1912.58888110 hartree
vibrat: 0.03078243 hartree
rotat: 0.01621836 hartree
total: 0.06867989 hartree
s2: 2.009084
dispersion: -0.033164446 hartree
s2: 2.009054
dispersion: -0.033191250 hartree
s2: 2.009027
dispersion: -0.033216268 hartree
s2: 2.009007
dispersion: -0.033245791 hartree
s2: 2.008990
dispersion: -0.033262725 hartree
s2: 2.008981
dispersion: -0.033288079 hartree
s2: 2.008972
dispersion: -0.033289238 hartree
s2: 2.008980
dispersion: -0.033306222 hartree
s2: 2.008984
dispersion: -0.033303436 hartree
s2: 2.008998
dispersion: -0.033325567 hartree
s2: 2.009015
dispersion: -0.033325304 hartree
s2: 2.009036
dispersion: -0.033374912 hartree
s2: 2.009043
dispersion: -0.033335801 hartree
dispersion: -0.033370966 hartree
s2: 2.009045
dispersion: -0.033351054 hartree
dispersion: -0.033355423 hartree
dispersion: -0.033357336 hartree
dispersion: -0.033354368 hartree
s2: 2.009030
energy: -2418.6438 -670.4354 -670.1797 -670.1625 -670.1608 -670.1031 -670.0567 -669.9324 -669.9299 -669.9223 -669.6784 -667.8671 -516.2770 -516.2690 -516.2683 -281.4488 -281.4392 -279.8376 -278.4823 -277.8271 -215.8063 -160.4522 -160.3140 -160.3139 -33.6107 -33.3621 -32.4001 -31.9111 -31.3127 -31.1696 -31.0681 -30.9354 -30.8852 -30.7245 -27.9661 -26.5116 -23.1063 -23.1023 -20.2062 -19.0303 -17.5292 -16.0889 -15.2280 -14.2840 -14.1887 -14.0738 -13.9167 -13.7932 -13.6579 -13.1868 -13.1022 -12.5006 -12.0592 -11.4128 -11.0799 -10.6995 -10.5480 -10.4653 -10.4378 -10.4047 -10.0847 -9.9489 -9.9183 -9.5730 -9.4485 -9.3801 -9.3274 -9.2530 -9.0532 -8.9831 -8.8598 -8.7593 -8.5907 -8.5876 -8.4028 -7.8497 -7.6877 -7.4217 -7.0265 -5.7083 -5.7054 -4.8346 -4.8327 -4.5110 -3.5364 -1.0160 1.7330 4.0385 4.2293 4.9799 5.5941 6.0406 6.0700 6.2325 6.4512 7.1383 7.4007 electronvolt
energy: -2418.6037 -670.2870 -670.1792 -670.1594 -670.1545 -670.0977 -670.0564 -669.9135 -669.9030 -669.8852 -669.6103 -667.8134 -516.1918 -516.1852 -516.1831 -281.4540 -281.4436 -279.8305 -278.2826 -277.4305 -215.7581 -160.3339 -160.2881 -160.2880 -33.6051 -33.3173 -32.3616 -31.6014 -31.2364 -31.0979 -31.0448 -30.8980 -30.8173 -30.6782 -27.8215 -26.3263 -22.8991 -22.8965 -19.6821 -18.7223 -17.3618 -15.9653 -15.0746 -14.2319 -14.0761 -14.0444 -13.8463 -13.6702 -13.4982 -13.0986 -12.9312 -12.3143 -11.6058 -10.9485 -10.7553 -10.5607 -10.4196 -10.3828 -10.3499 -10.3478 -9.9846 -9.8982 -9.8161 -9.5009 -9.3561 -9.3423 -9.2415 -9.0698 -9.0096 -8.9131 -8.7965 -8.7222 -8.4312 -8.4290 -8.2380 -7.6634 -7.5237 -7.3296 -6.9062 -5.5325 -5.5301 -4.5880 -4.5842 -3.4564 -0.4552 1.2492 2.8475 4.1987 4.6152 5.2270 5.7268 6.0838 6.1691 6.5088 6.6263 electronvolt
chargesum: -1.0000000
charge: 0.051444 0.284432 -0.130838 -0.175617 0.503532 0.313482 -0.186783 0.470017 -0.201583 -0.318525 -0.191372 -0.148503 -0.188000 -0.162411 -0.184331 -0.161455 0.888314 -0.487179 -0.489092 -0.485534
charge: -0.182680 -0.369185 0.250957 0.200156 -0.670432 -0.452265 0.205989 -0.662651 0.163333 -0.087327 0.190668 0.225865 0.177370 0.205417 0.181474 0.222414 0.460839 -0.352294 -0.354163 -0.353483
qa: 0.0514 0.2844 -0.1308 -0.1756 0.5035 0.3135 -0.1868 0.4700 -0.2016 -0.3185 -0.1914 -0.1485 -0.1880 -0.1624 -0.1843 -0.1615 0.8883 -0.4872 -0.4891 -0.4855
va: 3.9114 4.0071 1.1979 1.1252 4.5027 4.1602 1.1222 4.5104 1.0897 0.9226 1.1064 1.1652 1.1083 1.1468 1.1163 1.1541 5.7376 1.9303 1.9223 1.9096
dispersion: -0.033353737 hartree
energy: -1912.679272733373 hartree
dipole: 2.669726621 -3.599020921 -0.929294300 7.162366600 -9.793555737 -2.631189136 5.237721211 -7.248135605 -2.010414394
dipolemethod: SCF
magnitude: 3.439260124 au
magnitude: 8.741904505 debye
zeropoint: 0.06906129 hartree
thermalvibcorrection: 0.01755132 hartree
thermalrotcorrection: 0.00141627 hartree
thermaltrasncorrection: 0.00141627 hartree
thermaltotal: -1912.58982759 hartree
thermalcorr: 0.02038386 hartree
nonthermalcorr: 0.06906129 hartree
totalcorr: 0.08944515 hartree
totalenthalpy: -1912.58888338 hartree
vibrat: 0.03325464 hartree
rotat: 0.01619576 hartree
total: 0.07112949 hartree
