program: Orca
programVersion: 6.0.0
elementType: C C F F C C F C F F F F F F F F S O O O
charge: -1
multiplicity: 1
keywords: DLPNO-CCSD(T) def2-TZVPP def2-TZVPP/C VeryTightSCF TightPNO
formula: C5F11O3S
InChI: InChI=1/C5F10.FO3S/c6-1(2(7)4(10,11)12)3(8,9)5(13,14)15;1-5(2,3)4
20 atoms
C  -1.195125 -0.663799 0.644182
C  -0.350746 -1.237586 -0.204922
F  2.337649 -0.091545 0.571446
F  -0.989032 -0.660917 1.954538
C  -2.550578 -0.106514 0.24531
C  0.931448 -1.953754 0.128063
F  0.970088 -2.298163 1.436929
C  2.250609 -1.184032 -0.173675
F  0.980133 -3.107062 -0.602962
F  -0.857745 3.405851 -0.974937
F  -0.632771 -1.274478 -1.51046
F  -2.528854 0.595031 -0.87932
F  -3.070444 0.63511 1.22234
F  -3.416658 -1.149211 0.046588
F  3.296118 -1.985207 0.133993
F  2.338445 -0.875368 -1.462525
S  0.279044 2.469677 -0.260616
O  1.330757 3.412608 0.030693
O  0.563052 1.488087 -1.286936
O  -0.435605 1.948318 0.892492
totalener: -1905.98516050774560 hartree
nucrepener: 2221.46941661624260 hartree
electener: -4127.45457712398820 hartree
oneelecener: -7100.73073942646988 hartree
twoeener: 2973.27616230248168 hartree
kineticenergy: 1904.24979587046846 hartree
s2: 0.000000
energy: -2504.9155 -714.4654 -714.4386 -714.3844 -714.3791 -714.3699 -714.1348 -714.1138 -714.0661 -714.0638 -714.0007 -711.5117 -554.7707 -554.7154 -554.6757 -311.1150 -310.9974 -309.6377 -306.9572 -306.6609 -245.2982 -182.3848 -182.3178 -182.3162 -44.9017 -44.4992 -43.7330 -42.6641 -42.5054 -42.3174 -42.1545 -41.9816 -41.9208 -41.7370 -39.8723 -35.5235 -32.1260 -32.0999 -28.3034 -26.6370 -24.6075 -23.0682 -21.6961 -20.7504 -20.4665 -20.3434 -19.9929 -19.9325 -19.8237 -19.2938 -18.9987 -18.8635 -18.1530 -17.4571 -17.2428 -17.0389 -16.9345 -16.8685 -16.7549 -16.6736 -16.4652 -16.2344 -16.1875 -15.8029 -15.7450 -15.6412 -15.5292 -15.4011 -15.3735 -15.2961 -15.0774 -14.9095 -14.8622 -14.8016 -13.5704 -13.0686 -13.0505 -12.3829 -10.6330 -10.4803 -10.2529 -8.8896 -8.8310 -8.4288 -7.8524 5.8331 7.8271 8.4833 9.3238 9.8263 10.0335 10.3787 11.3868 11.5248 11.6699 11.8468 electronvolt
chargesum: -1.0000000
charge: 0.295203 0.153517 -0.208368 -0.234567 0.678521 0.522617 -0.241370 0.638255 -0.253514 -0.373560 -0.245609 -0.209454 -0.222357 -0.263591 -0.248199 -0.212763 1.424120 -0.656491 -0.663670 -0.678720
charge: -0.183786 -0.201949 0.201328 0.197413 -0.513831 -0.351921 0.160687 -0.534973 0.136540 -0.216528 0.184416 0.198616 0.180812 0.107409 0.138026 0.193458 0.534597 -0.408218 -0.413216 -0.408878
qa: 0.2952 0.1535 -0.2084 -0.2346 0.6785 0.5226 -0.2414 0.6383 -0.2535 -0.3736 -0.2456 -0.2095 -0.2224 -0.2636 -0.2482 -0.2128 1.4241 -0.6565 -0.6637 -0.6787
va: 3.9678 3.9521 1.0785 1.0196 4.2724 4.1840 1.0251 4.2705 1.0110 0.8452 1.0023 1.0687 1.0514 0.9823 1.0136 1.0687 6.0028 1.8162 1.7191 1.6996
corrType: DLPNO BASED
energy: -1910.527928834770 hartree
dipole: 1.220522256 -1.722195787 -0.501673531 6.267264442 -9.676655885 -3.409391443 -0.163341075 0.499992233 0.336651158
dipolemethod: SCF
magnitude: 3.462507811 au
magnitude: 8.800995430 debye
