program: Orca
programVersion: 6.0.0
elementType: C C F F C C F C F F F F F F F F S O O O
charge: -1
multiplicity: 1
keywords: B3LYP D3BJ TightOpt Freq def2-TZVPP def2/J RIJCOSX VeryTightSCF defgrid3
frequency: 0.00 0.00 0.00 0.00 0.00 0.00 8.07 29.42 34.95 49.75 56.97 64.84 65.60 79.57 89.89 105.49 147.98 154.13 208.25 231.14 238.80 291.84 308.66 325.26 328.16 360.63 383.18 389.22 404.85 427.30 463.80 509.29 527.62 535.68 547.52 567.95 569.34 583.09 609.33 645.79 676.40 699.73 730.90 754.14 898.19 1032.38 1062.27 1086.85 1109.54 1154.63 1177.17 1208.66 1226.04 1245.30 1282.64 1308.81 1320.88 1322.27 1350.76 1768.65
frequency: 8.07 29.42 34.95 49.75 56.97 64.84 65.60 79.57 89.89 105.49 147.98 154.13 208.25 231.14 238.80 291.84 308.66 325.26 328.16 360.63 383.18 389.22 404.85 427.30 463.80 509.29 527.62 535.68 547.52 567.95 569.34 583.09 609.33 645.79 676.40 699.73 730.90 754.14 898.19 1032.38 1062.27 1086.85 1109.54 1154.63 1177.17 1208.66 1226.04 1245.30 1282.64 1308.81 1320.88 1322.27 1350.76 1768.65
formula: C5F11O3S
InChI: InChI=1/C5F10.FO3S/c6-1(2(7)4(10,11)12)3(8,9)5(13,14)15;1-5(2,3)4
20 atoms
C  -0.888837 1.084902 0.664596
C  -0.538665 -0.064128 1.235231
F  1.102373 -2.492523 0.734412
F  -0.377387 2.207006 1.151194
C  -1.926603 1.33742 -0.418021
C  -1.027878 -1.458876 0.959616
F  -1.20075 -2.097729 2.153437
C  -0.068494 -2.35009 0.116182
F  -2.224089 -1.448685 0.328432
F  0.364224 -0.041282 2.220884
F  2.265542 0.104533 -0.018881
F  -1.87766 0.473738 -1.427183
F  -1.802832 2.572629 -0.897483
F  -3.179504 1.253889 0.120091
F  -0.618283 -3.57509 -0.023067
F  0.116087 -1.83541 -1.089947
S  2.253524 1.323052 -1.138246
O  3.083008 0.785604 -2.189564
O  2.795754 2.430716 -0.388098
O  0.836081 1.410155 -1.445973
totalener: -1912.74067798527972 hartree
nucrepener: 2268.06610528390911 hartree
electener: -4180.80678006747348 hartree
oneelecener: -7196.06871146565118 hartree
twoeener: 3015.26193139817769 hartree
kineticenergy: 1907.48142432451095 hartree
exchangeener: -148.824628418329 hartree
correlationener: -7.581182824558 hartree
xcener: -156.405811242887 hartree
s2: 0.000000
dispersion: -0.038560835 hartree
temp: 298.15 k
press: 1.00 atm
thermalcorrenthalpy: 0.00094421 hartree
totalenthalpy: -1912.68596803 hartree
vibrat: 0.02352899 hartree
rotat: 0.01604264 hartree
transl: 0.02064181 hartree
total: 0.06021345 hartree
totalentropycorr: -0.06021345 hartree
gibbsenthalpy: -1912.74618148 hartree
gibbsminuselec: 0.03305734 hartree
s2: -0.000000
dispersion: -0.038185573 hartree
dispersion: -0.037686987 hartree
dispersion: -0.037274861 hartree
dispersion: -0.036714217 hartree
dispersion: -0.036301537 hartree
dispersion: -0.036011257 hartree
dispersion: -0.035676495 hartree
dispersion: -0.035146148 hartree
dispersion: -0.035512976 hartree
dispersion: -0.034953600 hartree
dispersion: -0.034362318 hartree
dispersion: -0.034917967 hartree
dispersion: -0.035155303 hartree
dispersion: -0.035251324 hartree
dispersion: -0.035331336 hartree
dispersion: -0.035408118 hartree
dispersion: -0.035333984 hartree
dispersion: -0.035223422 hartree
dispersion: -0.035367165 hartree
dispersion: -0.035313447 hartree
totalenthalpy: -1912.71251696 hartree
vibrat: 0.02294716 hartree
rotat: 0.01618235 hartree
total: 0.05977132 hartree
dispersion: -0.035351890 hartree
dispersion: -0.035393480 hartree
dispersion: -0.035448556 hartree
dispersion: -0.035516065 hartree
dispersion: -0.035590355 hartree
dispersion: -0.035671879 hartree
dispersion: -0.035523928 hartree
dispersion: -0.035958227 hartree
dispersion: -0.035754022 hartree
dispersion: -0.035717351 hartree
dispersion: -0.035651696 hartree
dispersion: -0.035674165 hartree
dispersion: -0.035672538 hartree
dispersion: -0.035618587 hartree
dispersion: -0.035635195 hartree
dispersion: -0.035649172 hartree
dispersion: -0.035654218 hartree
dispersion: -0.035656869 hartree
dispersion: -0.035634479 hartree
dispersion: -0.034956370 hartree
totalenthalpy: -1912.66763816 hartree
vibrat: 0.02380589 hartree
rotat: 0.01619920 hartree
total: 0.06064690 hartree
dispersion: -0.035480362 hartree
dispersion: -0.035483760 hartree
dispersion: -0.035779856 hartree
dispersion: -0.035911500 hartree
dispersion: -0.035702748 hartree
dispersion: -0.035664335 hartree
dispersion: -0.035563607 hartree
dispersion: -0.035406150 hartree
dispersion: -0.035400374 hartree
dispersion: -0.035506990 hartree
dispersion: -0.035299482 hartree
dispersion: -0.035234197 hartree
dispersion: -0.035262036 hartree
dispersion: -0.035324778 hartree
dispersion: -0.035353834 hartree
dispersion: -0.035414993 hartree
dispersion: -0.035491810 hartree
dispersion: -0.035468855 hartree
dispersion: -0.035352062 hartree
dispersion: -0.035345384 hartree
totalenthalpy: -1912.71480539 hartree
vibrat: 0.03083819 hartree
rotat: 0.01617188 hartree
total: 0.06765188 hartree
dispersion: -0.035338306 hartree
dispersion: -0.035361094 hartree
dispersion: -0.035490745 hartree
dispersion: -0.035700162 hartree
dispersion: -0.035733320 hartree
dispersion: -0.035762109 hartree
dispersion: -0.035438492 hartree
dispersion: -0.035587077 hartree
dispersion: -0.035620930 hartree
dispersion: -0.035555274 hartree
dispersion: -0.035552178 hartree
dispersion: -0.035632990 hartree
dispersion: -0.035449165 hartree
dispersion: -0.035553771 hartree
dispersion: -0.035557049 hartree
dispersion: -0.035607527 hartree
dispersion: -0.035512071 hartree
dispersion: -0.035585665 hartree
dispersion: -0.035613770 hartree
dispersion: -0.035579456 hartree
totalenthalpy: -1912.71611520 hartree
vibrat: 0.03241089 hartree
rotat: 0.01616269 hartree
total: 0.06921539 hartree
dispersion: -0.035645567 hartree
dispersion: -0.035755465 hartree
dispersion: -0.035958830 hartree
dispersion: -0.035999433 hartree
dispersion: -0.036091141 hartree
dispersion: -0.035960169 hartree
dispersion: -0.036687472 hartree
dispersion: -0.036522140 hartree
dispersion: -0.036579278 hartree
dispersion: -0.036140276 hartree
dispersion: -0.036517426 hartree
dispersion: -0.037222309 hartree
dispersion: -0.036632277 hartree
dispersion: -0.036620463 hartree
dispersion: -0.036514930 hartree
dispersion: -0.036640732 hartree
dispersion: -0.036594522 hartree
dispersion: -0.036554630 hartree
dispersion: -0.036569225 hartree
dispersion: -0.036565974 hartree
totalenthalpy: -1912.71728279 hartree
vibrat: 0.03107621 hartree
rotat: 0.01609094 hartree
total: 0.06780895 hartree
dispersion: -0.036558028 hartree
dispersion: -0.036556482 hartree
dispersion: -0.036554075 hartree
energy: -2419.2755 -670.4276 -670.4010 -670.3563 -670.3039 -670.2954 -670.0193 -670.0144 -669.9776 -669.9755 -669.9746 -667.1508 -515.6360 -515.5419 -515.5271 -281.6362 -281.5176 -280.2560 -277.6824 -277.4679 -216.2205 -160.9236 -160.7326 -160.7216 -33.8405 -33.4283 -32.7551 -31.8211 -31.4765 -31.3590 -31.2905 -31.1009 -30.9942 -30.8423 -28.7386 -25.6526 -22.7344 -22.7156 -20.4226 -19.0121 -17.4170 -16.4168 -15.2127 -14.6108 -14.4916 -14.3216 -13.9673 -13.8960 -13.7983 -13.4281 -12.6678 -12.5980 -12.2805 -11.2569 -10.9574 -10.7886 -10.6508 -10.5118 -10.4582 -10.3711 -10.3289 -10.1005 -9.7794 -9.6934 -9.6629 -9.6178 -9.3859 -9.3270 -9.2525 -9.0932 -8.9372 -8.7383 -8.6516 -8.5962 -8.2066 -7.6325 -7.2218 -7.1277 -5.7162 -5.3231 -5.2489 -5.0926 -4.0143 -3.9625 -3.0226 1.5456 2.9318 4.6338 4.9100 5.6682 6.0550 6.4197 6.4887 6.7847 7.0248 7.2889 electronvolt
chargesum: -1.0000000
charge: 0.153178 0.130336 -0.152876 -0.157712 0.514920 0.336014 -0.187617 0.471494 -0.179616 -0.175234 -0.318494 -0.154740 -0.150834 -0.197729 -0.181603 -0.133734 0.963104 -0.519764 -0.517848 -0.541245
charge: -0.244716 -0.254623 0.231351 0.257329 -0.657082 -0.457899 0.185973 -0.669371 0.212948 0.232710 -0.192016 0.232610 0.231827 0.157492 0.187081 0.252157 0.353385 -0.353812 -0.355743 -0.349599
qa: 0.1532 0.1303 -0.1529 -0.1577 0.5149 0.3360 -0.1876 0.4715 -0.1796 -0.1752 -0.3185 -0.1547 -0.1508 -0.1977 -0.1816 -0.1337 0.9631 -0.5198 -0.5178 -0.5412
va: 3.8913 3.8339 1.1674 1.1589 4.5078 4.2557 1.1173 4.4521 1.1205 1.1302 0.9234 1.1589 1.1705 1.0876 1.1237 1.1946 6.3138 1.9585 1.9247 1.8497
dispersion: -0.036554526 hartree
energy: -1912.812537933035 hartree
dipole: 6.483804378 -9.759295210 -3.275490832 4.734874532 -6.585185954 -1.850311421 -3.283465502 4.904901217 1.621435715
dipolemethod: SCF
magnitude: 4.096528570 au
magnitude: 10.412548127 debye
zeropoint: 0.07463176 hartree
thermalvibcorrection: 0.01684798 hartree
thermalrotcorrection: 0.00141627 hartree
thermaltrasncorrection: 0.00141627 hartree
thermaltotal: -1912.71822565 hartree
thermalcorr: 0.01968052 hartree
nonthermalcorr: 0.07463176 hartree
totalcorr: 0.09431229 hartree
totalenthalpy: -1912.71728144 hartree
vibrat: 0.03124303 hartree
rotat: 0.01609116 hartree
total: 0.06797600 hartree
