program: Orca
programVersion: 6.0.0
elementType: C C F F C C F C F F F F F F F F S O O O
charge: -1
multiplicity: 1
keywords: DLPNO-CCSD(T) def2-TZVPP def2-TZVPP/C VeryTightSCF TightPNO
formula: C5F11O3S
InChI: InChI=1/C5F10.FO3S/c6-1(2(7)4(10,11)12)3(8,9)5(13,14)15;1-5(2,3)4
20 atoms
C  -0.888837 1.084902 0.664596
C  -0.538665 -0.064128 1.235231
F  1.102373 -2.492523 0.734412
F  -0.377387 2.207006 1.151194
C  -1.926603 1.33742 -0.418021
C  -1.027878 -1.458876 0.959616
F  -1.20075 -2.097729 2.153437
C  -0.068494 -2.35009 0.116182
F  -2.224089 -1.448685 0.328432
F  0.364224 -0.041282 2.220884
F  2.265542 0.104533 -0.018881
F  -1.87766 0.473738 -1.427183
F  -1.802832 2.572629 -0.897483
F  -3.179504 1.253889 0.120091
F  -0.618283 -3.57509 -0.023067
F  0.116087 -1.83541 -1.089947
S  2.253524 1.323052 -1.138246
O  3.083008 0.785604 -2.189564
O  2.795754 2.430716 -0.388098
O  0.836081 1.410155 -1.445973
totalener: -1905.98191765869706 hartree
nucrepener: 2229.55579301258695 hartree
electener: -4135.53771067128400 hartree
oneelecener: -7116.31334578327642 hartree
twoeener: 2980.77563511199241 hartree
kineticenergy: 1904.24094629198976 hartree
s2: -0.000000
energy: -2504.8534 -714.7015 -714.6456 -714.5959 -714.5473 -714.5472 -714.2642 -714.2331 -714.2319 -714.1179 -714.0744 -711.4354 -554.7373 -554.6451 -554.6384 -311.3034 -311.2172 -309.8409 -307.1341 -306.7844 -245.2381 -182.3263 -182.2561 -182.2532 -45.1033 -44.6830 -43.9511 -42.8522 -42.5448 -42.4005 -42.3440 -42.1809 -42.0578 -41.9195 -39.7207 -35.4782 -32.0773 -32.0453 -28.5066 -26.6972 -24.6899 -23.3746 -21.8000 -21.0916 -20.8341 -20.5475 -20.1863 -20.1094 -19.9963 -19.3897 -18.7709 -18.6951 -18.3197 -17.6018 -17.4699 -17.2184 -17.1037 -17.0136 -16.9113 -16.7887 -16.7607 -16.5131 -16.0902 -16.0329 -15.9333 -15.7686 -15.6767 -15.5502 -15.4726 -15.3773 -15.1937 -14.7874 -14.7765 -14.7289 -13.6228 -13.0834 -12.9873 -12.8067 -10.5285 -10.2798 -10.2025 -9.1196 -8.7552 -8.4259 -7.7660 5.7142 7.5408 8.5167 9.0974 9.7554 10.0345 10.2576 11.0863 11.3211 11.6802 11.7659 electronvolt
chargesum: -1.0000000
charge: 0.252356 0.161254 -0.218461 -0.224344 0.697576 0.532399 -0.250097 0.634772 -0.243837 -0.240283 -0.381624 -0.220521 -0.216366 -0.259177 -0.244795 -0.202161 1.397220 -0.652462 -0.647715 -0.673733
charge: -0.178664 -0.203389 0.186015 0.207542 -0.521987 -0.359880 0.140391 -0.535589 0.166459 0.182435 -0.231220 0.187979 0.187147 0.113690 0.143352 0.205041 0.542901 -0.409731 -0.410777 -0.411717
qa: 0.2524 0.1613 -0.2185 -0.2243 0.6976 0.5324 -0.2501 0.6348 -0.2438 -0.2403 -0.3816 -0.2205 -0.2164 -0.2592 -0.2448 -0.2022 1.3972 -0.6525 -0.6477 -0.6737
va: 3.9850 3.9250 1.0630 1.0388 4.2558 4.1831 1.0155 4.2519 1.0181 1.0080 0.8133 1.0508 1.0605 0.9872 1.0189 1.0877 6.0441 1.8064 1.7813 1.6996
corrType: DLPNO BASED
energy: -1910.525034334803 hartree
dipole: 6.483804241 -9.876237884 -3.392433643 4.734874651 -6.640771579 -1.905896928 -3.283465467 4.924703932 1.641238465
dipolemethod: SCF
magnitude: 4.223116482 au
magnitude: 10.734309027 debye
