program: Orca
programVersion: 6.0.0
elementType: C C F F C C F C F F F F F F F F S O O O
charge: -1
multiplicity: 1
keywords: B3LYP D3BJ TightOpt Freq def2-TZVPP def2/J RIJCOSX VeryTightSCF defgrid3
frequency: 0.00 0.00 0.00 0.00 0.00 0.00 22.52 27.71 32.04 50.50 54.29 60.56 69.06 77.77 97.01 111.03 150.79 180.42 192.81 219.12 251.56 253.49 289.81 320.45 328.26 353.05 372.81 386.66 391.24 404.09 457.74 502.43 534.59 534.85 563.34 571.30 573.91 584.99 598.49 634.25 662.95 700.64 706.13 744.63 862.22 1027.10 1063.18 1087.26 1139.60 1159.03 1189.43 1194.85 1226.92 1252.81 1277.71 1298.12 1312.15 1337.37 1382.83 1819.75
frequency: 22.52 27.71 32.04 50.50 54.29 60.56 69.06 77.77 97.01 111.03 150.79 180.42 192.81 219.12 251.56 253.49 289.81 320.45 328.26 353.05 372.81 386.66 391.24 404.09 457.74 502.43 534.59 534.85 563.34 571.30 573.91 584.99 598.49 634.25 662.95 700.64 706.13 744.63 862.22 1027.10 1063.18 1087.26 1139.60 1159.03 1189.43 1194.85 1226.92 1252.81 1277.71 1298.12 1312.15 1337.37 1382.83 1819.75
formula: C5F11O3S
InChI: InChI=1/C5F10.FO3S/c6-1(2(7)8)3(9,10)4(11,12)5(13,14)15;1-5(2,3)4
20 atoms
C  0.227183 2.253278 -0.947228
C  1.359549 2.173416 0.016265
F  2.464227 -0.017148 1.931101
F  0.624524 2.227632 -2.2395
C  -1.070876 2.356679 -0.684143
C  2.315457 0.954009 -0.255398
F  1.615556 -0.110804 -0.655155
C  3.185091 0.529896 0.965731
F  3.178013 1.295039 -1.248864
F  0.925385 2.134117 1.287799
F  2.141742 3.303321 -0.102432
F  -0.654786 -2.130426 -0.442212
F  -1.958601 2.496179 -1.636895
F  -1.598106 2.440641 0.503314
F  4.099429 -0.367064 0.558265
F  3.846411 1.590892 1.461073
S  -1.593957 -1.035384 0.337741
O  -2.60469 -1.865555 0.947865
O  -2.046164 -0.192176 -0.755398
O  -0.652936 -0.405459 1.240243
totalener: -1912.67453686673844 hartree
nucrepener: 2203.93957218811329 hartree
electener: -4116.61410139801774 hartree
oneelecener: -7067.74296466586748 hartree
twoeener: 2951.12886326784928 hartree
kineticenergy: 1906.81567311953449 hartree
exchangeener: -148.668574084660 hartree
correlationener: -7.564215676544 hartree
xcener: -156.232789761204 hartree
s2: 0.000000
dispersion: -0.037577862 hartree
temp: 298.15 k
press: 1.00 atm
thermalcorrenthalpy: 0.00094421 hartree
totalenthalpy: -1912.62014678 hartree
vibrat: 0.02576220 hartree
rotat: 0.01615019 hartree
transl: 0.02064181 hartree
total: 0.06255420 hartree
totalentropycorr: -0.06255420 hartree
gibbsenthalpy: -1912.68270099 hartree
gibbsminuselec: 0.02941374 hartree
s2: -0.000000
dispersion: -0.037446064 hartree
dispersion: -0.037413120 hartree
dispersion: -0.037251200 hartree
dispersion: -0.037295094 hartree
dispersion: -0.037305459 hartree
dispersion: -0.037376810 hartree
dispersion: -0.036895832 hartree
dispersion: -0.036763537 hartree
dispersion: -0.036694400 hartree
dispersion: -0.036553762 hartree
dispersion: -0.036454729 hartree
dispersion: -0.036146125 hartree
dispersion: -0.036242703 hartree
dispersion: -0.036392680 hartree
dispersion: -0.036268750 hartree
dispersion: -0.036355275 hartree
dispersion: -0.036334832 hartree
dispersion: -0.036416784 hartree
dispersion: -0.035722940 hartree
dispersion: -0.036188245 hartree
totalenthalpy: -1912.69704671 hartree
vibrat: 0.02869157 hartree
rotat: 0.01621284 hartree
total: 0.06554622 hartree
dispersion: -0.036418953 hartree
dispersion: -0.036443667 hartree
dispersion: -0.036478035 hartree
dispersion: -0.036486181 hartree
dispersion: -0.036455159 hartree
dispersion: -0.036309889 hartree
dispersion: -0.036185176 hartree
dispersion: -0.036082856 hartree
dispersion: -0.036108342 hartree
dispersion: -0.036179623 hartree
dispersion: -0.036213691 hartree
dispersion: -0.036171008 hartree
dispersion: -0.036112296 hartree
dispersion: -0.036703048 hartree
dispersion: -0.036581494 hartree
dispersion: -0.036317749 hartree
dispersion: -0.036316750 hartree
dispersion: -0.036101183 hartree
dispersion: -0.035984878 hartree
dispersion: -0.036066035 hartree
totalenthalpy: -1912.69919751 hartree
vibrat: 0.03142539 hartree
rotat: 0.01618172 hartree
total: 0.06824891 hartree
dispersion: -0.036001373 hartree
dispersion: -0.035977741 hartree
dispersion: -0.035939869 hartree
dispersion: -0.035880736 hartree
dispersion: -0.035801811 hartree
dispersion: -0.035708341 hartree
dispersion: -0.035611736 hartree
dispersion: -0.035510649 hartree
dispersion: -0.035445400 hartree
dispersion: -0.035604946 hartree
dispersion: -0.035883645 hartree
dispersion: -0.035914334 hartree
dispersion: -0.035715776 hartree
dispersion: -0.035885610 hartree
dispersion: -0.035879300 hartree
dispersion: -0.035943698 hartree
dispersion: -0.035943722 hartree
dispersion: -0.036066584 hartree
dispersion: -0.036139284 hartree
dispersion: -0.036298572 hartree
totalenthalpy: -1912.70204518 hartree
vibrat: 0.03086652 hartree
rotat: 0.01613285 hartree
total: 0.06764118 hartree
dispersion: -0.036166373 hartree
dispersion: -0.036160599 hartree
dispersion: -0.036165154 hartree
dispersion: -0.036187824 hartree
dispersion: -0.036180250 hartree
dispersion: -0.036181756 hartree
dispersion: -0.036169183 hartree
dispersion: -0.036172320 hartree
dispersion: -0.036171864 hartree
energy: -2419.2548 -670.5407 -670.4860 -670.3963 -670.2829 -670.2721 -670.1527 -670.0131 -669.9876 -669.8011 -669.7620 -667.1030 -515.5654 -515.5116 -515.4858 -281.7367 -279.9912 -279.9338 -279.2971 -276.9057 -216.1944 -160.8925 -160.7084 -160.7000 -33.9372 -32.8936 -32.6833 -32.2614 -31.5110 -31.4166 -31.3553 -31.0895 -30.9661 -30.5925 -28.7650 -25.5931 -22.6854 -22.6547 -20.0096 -19.2010 -17.6225 -16.1052 -15.1002 -14.5378 -14.4651 -14.3603 -13.8391 -13.6483 -13.5247 -13.3334 -12.6736 -12.3917 -12.3451 -11.9765 -11.0003 -10.9027 -10.7983 -10.4679 -10.2795 -10.0915 -10.0654 -9.9287 -9.8911 -9.8642 -9.7149 -9.6472 -9.4919 -9.2726 -9.2225 -9.1412 -8.8583 -8.8392 -8.6277 -8.5827 -8.3902 -7.1021 -7.0854 -7.0331 -5.6607 -5.3767 -5.2089 -4.5102 -3.9559 -3.9084 -3.0063 2.4832 3.1069 4.3036 4.9654 5.1025 5.5580 6.4514 6.5412 6.5990 6.9397 7.1931 electronvolt
chargesum: -1.0000000
charge: 0.022946 0.360458 -0.128091 -0.209051 0.434770 0.337734 -0.138800 0.450097 -0.188082 -0.162549 -0.205881 -0.312395 -0.149750 -0.131499 -0.171622 -0.174720 0.982711 -0.527216 -0.548097 -0.540963
charge: -0.281415 -0.456246 0.250604 0.192920 -0.445546 -0.461802 0.255289 -0.663154 0.192272 0.234450 0.158322 -0.185780 0.261675 0.279359 0.200600 0.199277 0.345320 -0.356333 -0.356003 -0.363809
qa: 0.0229 0.3605 -0.1281 -0.2091 0.4348 0.3377 -0.1388 0.4501 -0.1881 -0.1625 -0.2059 -0.3124 -0.1497 -0.1315 -0.1716 -0.1747 0.9827 -0.5272 -0.5481 -0.5410
va: 3.8118 4.1673 1.1980 1.0827 4.2197 4.0308 1.1924 4.5323 1.1177 1.1479 1.0859 0.9313 1.1842 1.2047 1.1373 1.1318 6.3152 1.9670 1.8570 1.8723
dispersion: -0.036170222 hartree
energy: -1912.797612212020 hartree
dipole: -7.361964182 10.260533129 2.898568947 -4.022265313 6.658987643 2.636722331 0.895954598 -1.235018296 -0.339063698
dipolemethod: SCF
magnitude: 3.933061248 au
magnitude: 9.997047215 debye
zeropoint: 0.07449066 hartree
thermalvibcorrection: 0.01694633 hartree
thermalrotcorrection: 0.00141627 hartree
thermaltrasncorrection: 0.00141627 hartree
thermaltotal: -1912.70334268 hartree
thermalcorr: 0.01977888 hartree
nonthermalcorr: 0.07449066 hartree
totalcorr: 0.09426953 hartree
totalenthalpy: -1912.70239847 hartree
vibrat: 0.03103467 hartree
rotat: 0.01613407 hartree
total: 0.06781055 hartree
