program: Orca
programVersion: 6.0.1
elementType: C C F F C C F C F F F F F F F F S O O O
charge: -1
multiplicity: 1
keywords: DLPNO-CCSD(T) def2-TZVPP def2-TZVPP/C VeryTightSCF TightPNO KeepDens CHELPG
formula: C5F11O3S
InChI: InChI=1/C5F11.O3S/c6-1(3(9,10)11)2(7,8)4(12,13)5(14,15)16;1-4(2)3
20 atoms
C  1.671122 0.66872 -0.024449
C  0.656775 -0.484693 0.26788
F  2.119821 1.222748 1.129036
F  1.094151 1.646671 -0.757695
C  2.960614 0.245779 -0.798148
C  -0.304633 -0.175329 1.299481
F  -0.910899 -2.390484 1.773673
C  -1.358205 -1.130478 1.593611
F  -0.924855 1.077962 1.027669
F  1.376988 -1.615795 0.559308
F  0.143032 -0.775355 -1.057516
F  3.761094 -0.523815 -0.049742
F  3.661287 1.355679 -1.115495
F  2.697343 -0.399706 -1.935967
F  -2.088655 -0.797455 2.696683
F  -2.367332 -1.255658 0.602741
S  -3.022524 0.814961 -1.276072
O  -3.383917 -0.386217 -1.958049
O  -1.927704 1.593798 -1.750431
O  -3.853503 1.308666 -0.226519
totalener: -1905.88381208821102 hartree
nucrepener: 2182.82724495262573 hartree
electener: -4088.71105704083675 hartree
oneelecener: -7024.47051158632166 hartree
twoeener: 2935.75945454548491 hartree
kineticenergy: 1904.13164129122038 hartree
energy: -2507.1680 -714.2093 -714.1963 -714.1624 -713.4465 -713.4329 -712.7866 -712.7589 -712.4249 -712.0998 -711.7553 -711.1338 -558.4112 -558.3963 -558.3952 -310.7810 -308.9951 -308.5961 -307.6387 -302.3722 -247.8232 -184.9175 -184.7905 -184.7902 -44.6219 -42.8316 -42.5451 -42.0396 -41.9193 -41.4854 -41.0892 -40.3133 -39.6607 -39.3808 -39.3576 -39.0171 -35.5021 -35.4801 -26.5963 -25.2804 -23.4665 -21.9852 -20.4196 -20.0862 -20.0344 -20.0228 -19.7265 -18.4984 -18.3311 -18.1037 -17.9548 -17.5873 -16.8646 -16.8111 -16.7703 -16.7571 -16.7093 -16.7033 -16.5784 -16.1061 -15.8892 -15.5240 -15.4882 -15.3171 -15.1751 -15.1484 -15.0603 -14.6689 -14.2292 -14.1972 -13.8942 -13.7860 -13.6576 -13.4238 -13.3884 -13.3356 -13.2499 -13.2147 -13.1442 -12.2311 -11.9894 -11.9100 -11.1084 -10.5066 -5.0472 5.1188 5.8528 8.8986 9.2367 9.4005 10.3565 10.7587 10.9614 11.2393 11.3587 11.7311 electronvolt
chargesum: -1.0000000
charge: 0.516908 0.433914 -0.248053 -0.241567 0.626467 -0.155069 -0.261436 0.642244 -0.365716 -0.272793 -0.340665 -0.236412 -0.248099 -0.230080 -0.271549 -0.327640 1.367054 -0.472700 -0.448997 -0.465810
charge: -0.349899 -0.360731 0.153873 0.160994 -0.515595 -0.391651 0.135371 -0.510634 0.001322 0.121709 -0.006319 0.159832 0.139297 0.170945 0.105031 0.014921 0.774105 -0.275230 -0.256989 -0.270352
qa: 0.5169 0.4339 -0.2481 -0.2416 0.6265 -0.1551 -0.2614 0.6422 -0.3657 -0.2728 -0.3407 -0.2364 -0.2481 -0.2301 -0.2715 -0.3276 1.3671 -0.4727 -0.4490 -0.4658
va: 4.0499 4.1042 1.0213 1.0270 4.2754 3.1133 0.9816 4.2658 0.8210 0.9634 0.8812 1.0334 1.0112 1.0462 0.9626 0.8746 5.6943 1.9680 1.9941 1.9706
e0: -1905.883812088 hartree
corrType: DLPNO BASED
energy: -1910.445697879155 hartree
dipole: -9.069125970 9.703592198 0.634466228 2.557212474 -2.094782840 0.462429635 -3.301064612 2.074439578 -1.226625034
dipolemethod: SCF
magnitude: 1.456364493 au
magnitude: 3.701784355 debye
