program: Orca
programVersion: 6.0.1
elementType: C C F F C C F C F F F F F F F F S O O O
charge: -1
multiplicity: 3
keywords: B3LYP D3BJ def2-TZVP VeryTightSCF IRC defgrid3 KeepDens CHELPG
keywords: PAL8
formula: C5F11O3S
InChI: InChI=1/C5F11.O3S/c6-1(3(9,10)11)2(7,8)4(12,13)5(14,15)16;1-4(2)3
20 atoms
C  0.955912 -1.454344 -0.792703
C  -0.18672 -0.967319 -0.034742
F  -2.101722 1.523669 -0.129507
F  0.85695 -2.687143 -1.334637
C  2.360741 -0.91832 -0.752771
C  -1.448722 -0.674747 -0.816168
F  -1.124131 -0.119791 -2.009183
C  -2.498382 0.262023 -0.140476
F  -2.109735 -1.853827 -1.082528
F  0.284535 0.472893 0.617503
F  -0.467944 -1.717563 1.062951
F  2.424859 0.356181 -1.143662
F  3.147953 -1.640344 -1.585482
F  2.904454 -1.00521 0.475272
F  -3.648495 0.19839 -0.849333
F  -2.765598 -0.138165 1.104488
S  0.809181 2.41612 1.751108
O  2.118992 2.087042 2.300032
O  -0.296603 2.477209 2.699278
O  0.784476 3.383246 0.66056
totalener: -1912.64575910186636 hartree
nucrepener: 2175.89218381328647 hartree
electener: -4088.53794345604683 hartree
oneelecener: -7011.46399097039375 hartree
twoeener: 2922.92604751434692 hartree
kineticenergy: 1906.97480608248634 hartree
exchangeener: -148.658481283196 hartree
correlationener: -7.548750306915 hartree
xcener: -156.207231590111 hartree
s2: 2.009030
energy: -2418.6518 -670.4355 -670.1797 -670.1626 -670.1609 -670.1031 -670.0568 -669.9325 -669.9299 -669.9223 -669.6784 -667.8672 -516.2750 -516.2672 -516.2665 -281.4489 -281.4392 -279.8377 -278.4825 -277.8272 -215.8142 -160.4573 -160.3233 -160.3232 -33.6108 -33.3621 -32.4002 -31.9112 -31.3127 -31.1697 -31.0682 -30.9354 -30.8853 -30.7245 -27.9665 -26.5128 -23.1068 -23.1028 -20.2063 -19.0303 -17.5293 -16.0889 -15.2281 -14.2841 -14.1887 -14.0739 -13.9167 -13.7933 -13.6580 -13.1869 -13.1022 -12.5007 -12.0594 -11.4130 -11.0802 -10.6995 -10.5481 -10.4653 -10.4379 -10.4048 -10.0848 -9.9490 -9.9184 -9.5733 -9.4488 -9.3802 -9.3276 -9.2533 -9.0532 -8.9833 -8.8599 -8.7594 -8.5910 -8.5879 -8.4029 -7.8502 -7.6880 -7.4220 -7.0267 -5.7087 -5.7058 -4.8351 -4.8333 -4.5111 -3.5370 -1.0161 1.7328 4.0384 4.2293 4.9799 5.5938 6.0403 6.0697 6.2324 6.4512 7.1382 7.4007 electronvolt
energy: -2418.6117 -670.2870 -670.1793 -670.1594 -670.1545 -670.0977 -670.0565 -669.9136 -669.9030 -669.8852 -669.6103 -667.8135 -516.1898 -516.1833 -516.1813 -281.4540 -281.4437 -279.8306 -278.2828 -277.4306 -215.7661 -160.3393 -160.2974 -160.2973 -33.6052 -33.3173 -32.3617 -31.6014 -31.2365 -31.0980 -31.0448 -30.8980 -30.8173 -30.6783 -27.8218 -26.3275 -22.8996 -22.8971 -19.6821 -18.7224 -17.3618 -15.9654 -15.0746 -14.2320 -14.0761 -14.0445 -13.8464 -13.6703 -13.4983 -13.0987 -12.9312 -12.3144 -11.6060 -10.9488 -10.7554 -10.5608 -10.4196 -10.3829 -10.3499 -10.3479 -9.9846 -9.8983 -9.8162 -9.5009 -9.3562 -9.3424 -9.2416 -9.0701 -9.0098 -8.9132 -8.7967 -8.7223 -8.4315 -8.4293 -8.2381 -7.6637 -7.5244 -7.3299 -6.9063 -5.5328 -5.5305 -4.5884 -4.5847 -3.4570 -0.4552 1.2493 2.8474 4.1987 4.6151 5.2269 5.7264 6.0838 6.1685 6.5087 6.6263 electronvolt
chargesum: -1.0000000
charge: 0.051432 0.284557 -0.130834 -0.175620 0.503586 0.313485 -0.186778 0.470039 -0.201583 -0.319493 -0.191373 -0.148506 -0.188001 -0.162414 -0.184330 -0.161452 0.883958 -0.485536 -0.487401 -0.483739
charge: -0.182681 -0.369149 0.250957 0.200155 -0.670429 -0.452265 0.205989 -0.662649 0.163333 -0.087436 0.190668 0.225865 0.177370 0.205417 0.181474 0.222415 0.467239 -0.354403 -0.356277 -0.355593
qa: 0.0514 0.2846 -0.1308 -0.1756 0.5036 0.3135 -0.1868 0.4700 -0.2016 -0.3195 -0.1914 -0.1485 -0.1880 -0.1624 -0.1843 -0.1615 0.8840 -0.4855 -0.4874 -0.4837
va: 3.9116 4.0067 1.1979 1.1252 4.5026 4.1603 1.1222 4.5103 1.0897 0.9216 1.1064 1.1652 1.1083 1.1468 1.1163 1.1541 5.7422 1.9315 1.9237 1.9113
dispersion: -0.033353737 hartree
energy: -1912.679112838881 hartree
dipole: 2.669726621 -3.599040118 -0.929313497 7.162366600 -9.793548251 -2.631181651 5.237721211 -7.248163611 -2.010442400
dipolemethod: SCF
magnitude: 3.439275956 au
magnitude: 8.741944747 debye
temp: 298.15 k
press: 1.00 atm
zeropoint: 0.06899760 hartree
thermalvibcorrection: 0.01667567 hartree
thermalrotcorrection: 0.00141627 hartree
thermaltrasncorrection: 0.00141627 hartree
thermaltotal: -1912.59060703 hartree
thermalcorr: 0.01950821 hartree
nonthermalcorr: 0.06899760 hartree
totalcorr: 0.08850581 hartree
thermalcorrenthalpy: 0.00094421 hartree
totalenthalpy: -1912.58966282 hartree
vibrat: 0.03128907 hartree
rotat: 0.01619576 hartree
transl: 0.02064181 hartree
total: 0.06916392 hartree
totalentropycorr: -0.06916392 hartree
gibbsenthalpy: -1912.65882674 hartree
gibbsminuselec: 0.02028610 hartree
