program: Gaussian 16
title: Title
version: ES64L-G16RevC.01
frameworkgroup: C1[X(C2Cs4O6)]
method: RPBE1PBE
basis: def2SVP
operation: Freq
keyword: #N
keyword: Geom=AllCheck
keyword: Guess=TCheck
keyword: SCRF=Check
keyword: GenChk
keyword: RPBE1PBE/def2SVP
keyword: Freq
converged: YES YES NO NO
title: Mulliken charges:
elementType: C O O O Cs Cs C O O O Cs Cs
charge: 0.303475 -0.538888 -0.520719 -0.538859 0.757703 0.534179 0.306157 -0.524602 -0.537909 -0.537869 0.534390 0.762941
chargesum: -0.00000
title: Mulliken charges with hydrogens summed into heavy atoms:
chargesum: 0.00000
1716.lowfreq: -18.8370 -4.6114 -0.0002 0.0006 0.0007 6.8988 10.0573 14.4132 14.9962
frequency: 8.3731 9.9461 14.3820 16.8720 27.0694 51.7613 76.4339 101.8973 106.9398 118.1809 125.1462 129.0571 137.1255 153.4718 155.1479 162.9420 173.9012 190.6721 696.3552 698.2259 699.1390 702.2049 892.0088 895.0147 1091.3688 1092.8287 1464.3701 1470.6992 1490.7078 1497.5779
redmass: 43.7893 80.7691 46.8450 62.6863 45.3441 49.3210 18.2205 17.6802 23.1406 19.3663 21.6356 20.0532 16.9791 18.2590 17.1735 17.7125 16.3993 16.2476 15.6251 15.6260 15.6335 15.6220 12.6254 12.6417 15.9903 15.9888 12.8747 12.8763 12.8747 12.8761
irintensity: 1.1119 10.7498 0.3840 8.0776 22.3839 0.7630 4.8613 5.4320 21.4124 0.0192 74.9763 146.7624 28.2066 128.1193 76.7335 47.0431 3.7965 4.5385 3.3624 25.3290 12.6884 17.7767 51.9834 14.7645 0.8934 1.6158 29.5754 1955.5415 2241.7462 93.5304
temp: 298.150 k
press: 1.00000 atm
elementType: 6 8 8 8 55 55 6 8 8 8 55 55
symmnumber: 1
zpe: 86429.1 jmol-1
zpe.correction: 0.032919 hartree
zpe.thermalcorrener: 0.049806 hartree
zpe.thermalcorrenthalpy: 0.050750 hartree
zpe.thermalcorrgfe: -0.025394 hartree
zpe.sumelectzpe: -607.629749 hartree
zpe.sumelectthermal: -607.612862 hartree
zpe.sumelectthermalent: -607.611918 hartree
zpe.sumelectthermalfe: -607.688062 hartree
dipole: -3.4584 -0.0303 -2.9448
dipole: 4.5424
quadrupole: -11.2903 -103.2212 -145.9198
quadrupole: -0.0297 -41.4841 -0.0168
quadrupole: 75.5201 -16.4108 -59.1094 -0.0297 -41.4841 -0.0168
hfenergy: -607.6626685 hartree
pointgroup: C01 [X(C2Cs4O6)]
dipole: -1.3606509 0.0119196 1.1585777 debye
dipolederiv: 2.7449136 -0.0012378 0.5362587 -0.0014445 2.6463959 0.0029675 0.6894435 0.0032936 0.3068805 -1.5483191 0.4066011 -0.084654 0.398041 -1.8343013 0.1260062 -0.1447944 0.198175 -0.6833656 -2.1786934 0.0008326 -0.2638639 0.0009711 -1.0651626 -0.0001699 -0.2887055 0.0000371 -0.8461785 -1.5486516 -0.405537 -0.0860758 -0.3967137 -1.8331449 -0.1288186 -0.1465722 -0.2011518 -0.6838135 1.4149124 -0.0004788 0.1212265 -0.0005218 0.9034662 -0.0000419 0.172895 -0.000097 0.8852101 1.1681246 0.04273 -0.1862084 0.0270284 1.1856675 0.0374756 -0.2639989 0.0312397 0.962154 2.3315272 0.003473 1.0210392 0.0033978 2.6419229 -0.0047298 1.1454448 -0.0052466 0.7265183 -1.9731713 -0.0022853 -0.5550403 -0.0021631 -1.0711993 -0.0003598 -0.5345817 -0.000368 -1.0542147 -1.3958813 0.3495352 -0.2868763 0.367142 -1.8293333 0.2103077 -0.3436586 0.2894664 -0.8286819 -1.3956439 -0.3518067 -0.2842575 -0.3694321 -1.8321108 -0.2052968 -0.3404431 -0.2840922 -0.8265691 1.167941 -0.0426499 -0.186302 -0.0272565 1.1849365 -0.0377942 -0.2643327 -0.0316306 0.9624795 1.2129418 0.0008234 0.2547538 0.0009514 0.9028634 0.0004539 0.3193038 0.0003741 1.0795809 unknown
polarizability: 193.5411725|0.0200426|181.4103141|12.7091704|-0.0123452|141.4872039 unknown
InChI: InChI=1/2CO3.4Cs/c2*2-1(3)4;;;;/rC2Cs4O6/c3-1-5(7(1)3)2-4(9(2)5)10(2)6(1,2,8(1)3,11(1)5)12(2)5
charge 0 multiplicity 1
12 atoms
C  -1.765789 -0.000458 1.140747
O  -2.388413 1.118155 0.957733
O  -0.519953 -0.001233 1.460488
O  -2.389056 -1.11815 0.954303
Cs -4.931479 0.002845 0.157387
Cs 0.039684 -2.316684 -0.353463
C  2.115499 -0.002333 -1.409749
O  0.973107 -0.004065 -2.001791
O  2.680447 -1.118808 -1.083476
O  2.680348 1.116016 -1.089938
Cs 0.039971 2.311999 -0.355883
Cs 4.662913 0.003321 0.698059
