program: Gaussian 16
title: Title
version: ES64L-G16RevA.03
method: RPBE1PBE
basis: def2SVP
operation: Freq
keyword: #N
keyword: Geom=AllCheck
keyword: Guess=TCheck
keyword: SCRF=Check
keyword: GenChk
keyword: RPBE1PBE/def2SVP
keyword: Freq
converged: YES YES NO NO
title: Mulliken charges:
elementType: Pd P P C C C C H C H C H H H C C C C H C H C H H H C C C C H C H C H H H C C C C H C H C H H H C C C C H C H C H H H C C C C H C H C H H H C H H C H C H H
charge: -0.235757 0.480279 0.425977 -0.185351 -0.007087 -0.010290 -0.029459 0.068840 -0.036843 0.065134 -0.025955 0.049515 0.054831 0.056813 -0.198663 -0.024965 -0.010354 -0.026730 0.088675 -0.030238 0.046126 -0.025569 0.051094 0.053841 0.056709 -0.178483 -0.023905 -0.009586 -0.033886 0.060147 -0.040392 0.063908 -0.029349 0.052144 0.053393 0.054682 -0.177279 -0.029009 0.007709 -0.030623 0.053810 -0.039112 0.052982 -0.029327 0.050191 0.048108 0.053192 -0.188611 -0.003764 -0.022019 -0.038655 0.061833 -0.033659 0.078210 -0.021968 0.055144 0.052638 0.057167 -0.168071 -0.017170 -0.036567 -0.031328 0.053983 -0.029770 0.083071 -0.026904 0.053158 0.051952 0.056223 -0.030028 0.128890 0.122438 -0.150706 0.129501 -0.034982 0.134869 0.135238
chargesum: 1.00000
title: Mulliken charges with hydrogens summed into heavy atoms:
elementType: Pd P P C C C C C C C C C C C C C C C C C C C C C C C C C C C C C C C C C C C C C C C
charge: -0.235757 0.480279 0.425977 -0.185351 0.061753 0.054844 0.020056 0.017989 0.030858 -0.198663 0.063710 0.035773 0.024364 0.023603 0.031139 -0.178483 0.036242 0.054322 0.018258 0.013001 0.025333 -0.177279 0.024801 0.060691 0.019568 0.008996 0.023866 -0.188611 0.058069 0.056191 0.016489 0.018979 0.035199 -0.168071 0.036813 0.046504 0.021830 0.022182 0.029319 0.221299 -0.021206 0.235125
1716.lowfreq: -7.5089 -0.0020 -0.0019 -0.0017 4.4748 8.6711 16.1686 21.3479 28.2962
frequency: 16.1180 21.2548 28.1323 33.6197 40.7813 45.2937 48.0326 52.0803 56.8915 59.0624 60.7299 61.6219 69.7188 76.0978 79.1276 84.7267 90.4889 105.7805 109.2224 120.1150 132.7052 135.2380 178.2334 191.2615 200.9690 203.8790 213.1413 221.2464 234.3442 236.0334 254.6705 256.9723 261.5191 262.5837 281.4277 283.2128 343.9968 372.4457 388.8995 409.9801 412.3653 414.3774 416.0227 421.9717 427.2506 437.6687 439.2082 450.3624 453.9378 464.2920 467.8118 479.5024 507.9048 511.7559 519.9651 521.4911 536.7924 545.3279 626.6540 626.9255 627.5977 627.6639 628.2033 629.6222 703.9902 705.7511 717.8352 719.9431 721.0453 723.1614 723.9490 725.5058 727.3783 727.6782 730.4323 734.7009 749.7707 770.6695 772.2816 772.9200 773.2684 774.0150 779.8099 780.9699 871.1033 873.4974 876.2696 877.1077 881.7473 886.6574 911.2226 936.5295 952.2976 954.8162 955.3196 958.8566 959.4473 967.9979 973.6568 1012.6110 1013.7197 1014.0031 1014.6080 1015.3107 1015.5837 1015.7170 1017.1782 1017.7188 1018.5577 1022.5295 1024.5636 1034.7085 1038.3128 1038.8162 1039.3269 1039.5767 1040.8589 1043.3286 1044.7058 1057.0061 1058.2985 1058.5359 1059.1132 1059.3645 1059.4615 1102.1067 1105.7412 1106.2101 1106.7204 1109.3601 1110.0858 1129.2165 1132.1481 1134.1971 1135.4966 1135.6148 1136.9746 1157.5233 1158.0952 1158.2032 1158.5362 1158.6023 1158.8265 1183.5058 1187.9863 1188.8306 1189.3180 1191.1532 1191.3697 1226.0807 1247.1883 1317.6098 1320.6956 1322.9111 1324.1337 1326.5704 1327.2613 1388.1025 1388.3149 1389.1953 1390.2835 1390.8770 1392.7747 1393.2987 1468.3019 1468.6621 1469.5951 1470.9768 1473.2854 1473.4462 1475.5472 1514.6371 1516.0958 1516.3447 1516.8245 1517.0363 1517.9016 1564.6046 1653.2008 1653.3069 1655.1706 1655.3626 1656.8856 1657.1370 1669.5629 1669.9190 1670.5417 1670.7519 1671.6239 1671.8763 3143.4346 3149.9356 3190.6400 3196.4369 3196.5447 3200.1245 3207.5923 3208.3146 3209.1860 3209.6119 3209.9697 3211.2203 3213.1979 3215.8459 3216.1992 3217.3323 3217.8138 3219.4692 3220.1972 3221.4560 3223.9330 3223.9722 3224.7478 3225.6501 3227.3081 3229.2617 3229.6324 3230.9552 3231.4568 3231.8841 3232.7744 3232.9783 3237.1893 3263.0040 3264.2367
redmass: 5.5767 5.7647 5.0751 4.1291 4.9863 4.5673 4.7831 5.1625 4.9439 4.9994 4.7175 4.8449 4.2931 4.7244 4.7924 4.4956 3.9100 6.1037 3.9617 3.5454 4.6909 7.9697 7.0740 5.5162 4.9606 5.5098 5.5423 5.4598 4.7461 4.8445 4.9560 5.0399 5.2584 5.1292 4.7958 4.9230 5.8110 4.9284 2.2194 2.8176 2.8169 2.8440 2.8753 2.8987 3.0061 6.5980 5.9572 6.7795 5.0777 5.9173 5.8592 1.9718 4.8577 4.8983 4.5107 4.8822 4.6229 5.2112 6.3586 6.3664 6.3668 6.3633 6.3585 6.3740 6.2086 6.3092 1.7048 3.7929 2.2988 2.5681 1.9946 2.0230 1.9854 3.7756 3.9327 2.0902 1.1191 1.7746 1.5680 1.8161 1.5584 1.7964 1.9515 1.8939 1.2546 1.2502 1.2457 1.2444 1.2392 1.2312 1.1599 1.1749 1.2865 1.3723 1.3036 1.3524 1.3477 1.3454 1.3279 1.4903 4.8316 3.2844 5.1672 3.1475 2.8520 1.7576 2.4183 1.9704 2.4500 1.4222 1.3790 1.4362 1.4518 1.3380 1.3583 1.3433 1.3474 1.3460 1.3494 2.3344 2.4632 2.4108 2.4314 2.4218 2.4540 1.4704 1.4927 1.4816 1.4824 1.4802 1.4813 2.9991 3.0127 3.0115 2.9807 2.8694 2.9815 1.0616 1.0606 1.0636 1.0608 1.0603 1.0597 1.1124 1.1103 1.1108 1.1119 1.1095 1.1088 1.2551 1.9852 1.3552 1.3721 1.3443 1.3558 1.3282 1.3277 6.2293 6.3264 6.7703 1.2770 4.9797 7.5068 7.4440 2.4191 2.4129 2.4255 2.4236 2.4178 2.4518 1.4521 2.3256 2.2875 2.3025 2.2955 2.2991 2.2851 3.4326 6.2607 6.2327 6.3374 6.3325 6.3817 6.3978 6.4189 6.3790 6.3734 6.3209 6.4138 6.3895 1.0598 1.0589 1.0938 1.0906 1.0908 1.0899 1.0874 1.0869 1.0870 1.0883 1.0881 1.0885 1.0896 1.0894 1.0902 1.0923 1.0920 1.0926 1.0935 1.0932 1.0955 1.0949 1.0967 1.0967 1.0970 1.0974 1.0973 1.1012 1.1012 1.1013 1.1013 1.1005 1.0969 1.1160 1.1173
irintensity: 0.0172 0.0298 0.0062 0.1207 0.0886 0.0324 0.0242 0.0905 0.0221 0.0100 0.0546 0.0611 0.1190 0.1157 0.3216 0.6900 0.3656 0.9026 0.2906 0.8959 5.3850 0.8256 3.5769 1.4449 1.1505 0.5613 2.2570 5.8607 0.7998 1.5674 2.9803 0.8813 0.9726 0.5296 2.4717 0.8360 0.9129 6.3508 1.4553 0.1594 0.2129 0.6610 0.7820 0.6276 0.7379 40.8120 15.8661 28.0748 14.9944 21.0086 28.1931 28.1822 64.7315 78.9937 128.2990 128.4402 208.8524 102.5921 0.2582 0.5243 0.6352 2.6321 1.9534 2.1306 14.8771 11.8226 99.2161 28.9658 106.5538 34.6665 77.6114 67.7840 49.0490 12.7014 35.2166 40.6615 0.9742 21.1284 7.5131 20.2912 14.8216 14.1064 17.6227 14.5811 1.2662 0.1584 0.1975 1.5209 0.0626 0.1077 9.5229 10.7541 15.9409 1.5774 9.4200 1.1223 1.5280 0.8204 2.2904 0.3399 4.1362 5.2675 2.2430 5.1419 3.5915 0.9178 5.1079 2.0512 2.0443 0.2700 0.1511 22.5594 2.1860 0.0899 0.3688 0.0131 0.2795 0.2339 0.9667 9.9132 7.8727 6.2742 2.7613 5.9213 5.6871 3.7312 5.2294 9.1853 8.2649 6.1922 5.9808 44.2688 50.2922 81.8618 48.3160 19.8557 52.5127 0.0576 0.1375 0.4242 0.3106 0.0777 0.2329 4.7581 3.5294 5.4132 4.5792 2.7517 4.7323 2.0702 1.9188 2.1973 7.6830 3.7715 12.2803 3.8840 8.2041 0.0462 0.4941 0.5615 11.9155 2.2100 1.3612 0.6931 43.5846 39.6065 30.9818 45.8155 50.8653 48.0240 2.6356 15.3248 19.6238 11.2567 9.6215 5.4227 14.1500 2.5060 1.5438 0.8873 1.3745 2.3817 4.1975 3.8267 0.6286 0.2280 0.6248 2.3635 1.1011 1.9913 0.6641 1.7003 3.2359 1.5983 0.1516 0.8240 0.1333 0.0316 0.0540 0.1570 0.3440 0.1227 0.5610 1.4396 6.3708 2.5666 2.6196 3.5125 5.1389 0.6746 6.5167 1.8984 7.3062 2.8756 6.4673 1.8673 9.6663 12.4544 10.6277 13.6436 10.7252 9.5529 8.5643 1.0323 0.4412
temp: 298.150 k
press: 1.00000 atm
elementType: 46 15 15 6 6 6 6 1 6 1 6 1 1 1 6 6 6 6 1 6 1 6 1 1 1 6 6 6 6 1 6 1 6 1 1 1 6 6 6 6 1 6 1 6 1 1 1 6 6 6 6 1 6 1 6 1 1 1 6 6 6 6 1 6 1 6 1 1 1 6 1 1 6 1 6 1 1
symmnumber: 1
zpe: 1646268.9 jmol-1
zpe.correction: 0.627031 hartree
zpe.thermalcorrener: 0.665544 hartree
zpe.thermalcorrenthalpy: 0.666489 hartree
zpe.thermalcorrgfe: 0.553146 hartree
zpe.sumelectzpe: -2313.951894 hartree
zpe.sumelectthermal: -2313.913380 hartree
zpe.sumelectthermalent: -2313.912436 hartree
zpe.sumelectthermalfe: -2314.025778 hartree
dipole: 0.3084 -0.7100 -1.6784
dipole: 1.8483
quadrupole: -221.7606 -220.7880 -232.7256
quadrupole: -1.4690 -2.5087 -2.8808
quadrupole: 3.3308 4.3034 -7.6341 -1.4690 -2.5087 -2.8808
hfenergy: -2314.5789243 hartree
pointgroup: C01 [X(C39H35P2Pd1)]
dipole: -0.1179341 -0.1483345 -0.7020422 debye
polarizability: 701.8585483|5.5132814|769.6424844|1.3597342|-19.5961514|721.3508423 unknown
InChI: InChI=1/2C18H15P.C3H5.Pd/c2*1-4-10-16(11-5-1)19(17-12-6-2-7-13-17)18-14-8-3-9-15-18;1-3-2;/h2*1-15H;3H,1-2H2;/rC39H35P2Pd/c1-7-19-33(20-8-1)40(34-21-9-2-10-22-34,35-23-11-3-12-24-35)42(31-39(42)32-42)41(36-25-13-4-14-26-36,37-27-15-5-16-28-37)38-29-17-6-18-30-38/h1-30,39H,31-32H2
charge 1 multiplicity 1
77 atoms
Pd -0.02338242 -0.27695654 -1.39806432
P  1.74473417 0.41650077 -0.06897605
P  -1.87461218 0.19614086 -0.0493129
C  2.00171657 -0.55939093 1.44778453
C  1.0650135 -1.54262618 1.7833403
C  3.13566561 -0.37936187 2.25494067
C  1.23740425 -2.31524087 2.93153994
H  0.20151592 -1.70617747 1.13391155
C  3.30169807 -1.149198 3.40313408
H  3.89778683 0.35420458 1.98039251
C  2.35044738 -2.11319472 3.74557803
H  0.49861145 -3.07870009 3.18690015
H  4.18347666 -1.00116253 4.0314466
H  2.48629216 -2.71772902 4.64597366
C  1.5055267 2.16393933 0.39485955
C  0.78949386 2.95978719 -0.50984635
C  1.96262212 2.72074511 1.59387371
C  0.52066239 4.29431082 -0.21306998
H  0.42308207 2.51973258 -1.44168912
C  1.68904034 4.05531575 1.88911069
H  2.50984784 2.11285409 2.31610181
C  0.96461351 4.84119625 0.99152984
H  -0.04959078 4.90312156 -0.91901333
H  2.03626586 4.48107392 2.83380184
H  0.74406826 5.88392614 1.23351163
C  3.39466614 0.38063835 -0.85825099
C  4.02867576 1.5469732 -1.29703318
C  4.00420376 -0.86345938 -1.07712514
C  5.26180692 1.46944983 -1.94717615
H  3.56460325 2.52188115 -1.13051277
C  5.23591125 -0.9346099 -1.72152875
H  3.51391546 -1.78208736 -0.74168427
C  5.86715736 0.23227569 -2.15948325
H  5.75220279 2.38627919 -2.28409562
H  5.70619782 -1.90753479 -1.88496582
H  6.83373203 0.17429782 -2.66632097
C  -1.69523439 0.40628797 1.76021539
C  -2.04380227 -0.6146326 2.65237135
C  -1.13027751 1.58887187 2.25796436
C  -1.81168864 -0.46281579 4.01883204
H  -2.4926483 -1.53959026 2.2850368
C  -0.89925144 1.73512554 3.62365379
H  -0.87686119 2.4049199 1.57920245
C  -1.23229253 0.70751206 4.50703246
H  -2.08523955 -1.26880645 4.70428439
H  -0.45465294 2.66060202 3.99782256
H  -1.04631214 0.8228239 5.57780993
C  -2.70055075 1.73224367 -0.58465808
C  -3.59670649 2.41300955 0.25138722
C  -2.43016405 2.23796027 -1.86243873
C  -4.21340219 3.58169892 -0.19033579
H  -3.81141142 2.0327081 1.25285394
C  -3.05086021 3.40649517 -2.3013579
H  -1.71771818 1.72022853 -2.50915256
C  -3.94105945 4.08017818 -1.46532512
H  -4.91004745 4.10734264 0.4674146
H  -2.82963137 3.79614557 -3.29799378
H  -4.42262492 5.00020449 -1.80631457
C  -3.1171624 -1.13558126 -0.20352798
C  -4.48706941 -0.88080346 -0.32395766
C  -2.6581757 -2.46062535 -0.19143349
C  -5.38679469 -1.94194195 -0.42855688
H  -4.85852831 0.14609088 -0.34310608
C  -3.56115321 -3.5172833 -0.28287489
H  -1.5853781 -2.66289895 -0.11264936
C  -4.92757004 -3.25846258 -0.40432181
H  -6.45516388 -1.73518934 -0.52975051
H  -3.19519563 -4.54683519 -0.26781059
H  -5.63614739 -4.08662852 -0.48557825
C  1.1867378 -0.96681551 -3.04865841
H  1.33065932 -2.00369363 -2.72056304
H  2.09034619 -0.42320531 -3.33532326
C  -0.06217334 -0.54991054 -3.5493055
H  -0.12052249 0.37831912 -4.12998798
C  -1.23884849 -1.09654462 -3.00823867
H  -1.25254553 -2.13719794 -2.66434441
H  -2.208775 -0.66046836 -3.26117513
