program: Gaussian 16
title: Title
version: ES64L-G16RevC.01
frameworkgroup: C1[X(C18H15P)]
method: RPBE1PBE
basis: def2SVP
operation: Freq
keyword: #N
keyword: Geom=AllCheck
keyword: Guess=TCheck
keyword: SCRF=Check
keyword: GenChk
keyword: RPBE1PBE/def2SVPFreq
converged: YES YES NO NO
title: Mulliken charges:
elementType: P C C C C H C H C H H H C C C C H C H C H H H C C C C H C H C H H H
charge: 0.373311 -0.226071 -0.009946 -0.020053 -0.041685 0.044130 -0.036078 0.050386 -0.036598 0.051231 0.048683 0.051521 -0.226230 -0.009822 -0.019514 -0.041619 0.044049 -0.035851 0.050038 -0.036382 0.051212 0.048687 0.051560 -0.225949 -0.020391 -0.010221 -0.035920 0.050172 -0.041641 0.044196 -0.036589 0.048671 0.051189 0.051526
chargesum: -0.00000
title: Mulliken charges with hydrogens summed into heavy atoms:
elementType: P C C C C C C C C C C C C C C C C C C
charge: 0.373311 -0.226071 0.034184 0.030333 0.009546 0.012606 0.014923 -0.226230 0.034226 0.030523 0.009592 0.012835 0.015178 -0.225949 0.029781 0.033974 0.012752 0.009548 0.014938
1716.lowfreq: -7.9393 -3.3729 -0.0016 0.0009 0.0011 6.5669 22.6515 28.1276 46.5863
frequency: 22.4430 28.1216 46.5367 52.6048 53.5591 66.2623 187.1738 203.6816 203.8773 252.0359 265.2594 266.3000 410.1373 410.8470 412.7379 416.5202 439.0721 439.2394 512.9051 513.4970 521.9843 627.0735 627.1821 627.4659 698.2848 714.8404 715.1312 723.3295 723.6724 724.2875 775.4039 776.0521 776.7053 874.1126 874.1565 874.3615 951.5282 951.9475 952.2968 1012.4462 1012.6045 1012.9744 1014.1566 1014.4050 1014.8640 1036.7506 1036.8962 1037.6309 1056.0544 1056.2615 1056.6492 1099.1910 1099.6421 1100.9221 1124.3885 1124.7365 1129.9856 1154.5746 1155.1472 1156.2636 1182.1237 1182.6349 1184.0864 1315.7125 1318.0293 1318.9306 1384.4701 1387.4038 1387.7093 1467.3176 1468.8152 1469.3313 1513.4858 1513.6777 1514.4147 1652.0621 1653.2771 1653.5935 1668.7303 1668.8592 1670.6922 3192.6989 3193.2205 3194.7776 3204.5649 3204.7274 3204.8066 3212.5624 3212.7168 3212.9875 3219.0500 3219.2825 3219.4330 3227.2409 3227.2974 3227.5304
redmass: 3.7486 3.7399 3.7436 5.1685 5.1850 5.1342 4.4962 4.5855 4.5924 5.4941 4.6891 4.7002 2.8739 2.8707 4.7140 3.4110 7.6164 7.6052 3.8842 3.8731 4.0316 6.3524 6.3501 6.3608 6.3499 6.3409 6.3113 1.5849 1.5788 1.5837 2.0042 2.0176 2.0123 1.2510 1.2509 1.2509 1.3821 1.3821 1.3815 3.2549 3.2574 2.0949 1.7217 1.7653 2.3654 1.3406 1.3403 1.3405 2.4526 2.4664 2.4746 1.4687 1.4657 1.4730 2.9574 2.9393 2.8809 1.0605 1.0612 1.0623 1.1079 1.1071 1.1061 1.3710 1.3521 1.3540 6.5722 7.1366 7.0810 2.4185 2.4333 2.4267 2.3095 2.3247 2.3162 6.3334 6.3813 6.3615 6.4036 6.3931 6.4198 1.0902 1.0901 1.0898 1.0879 1.0878 1.0877 1.0921 1.0921 1.0922 1.0967 1.0965 1.0965 1.1011 1.1011 1.1011
irintensity: 0.3605 0.3410 0.1020 0.1714 0.1897 0.6748 0.5772 1.9877 1.9683 1.5306 0.8595 0.8874 2.0158 2.0123 1.8530 0.5708 11.9883 11.9271 53.0690 53.2563 44.8703 0.5736 0.6327 0.7164 2.0852 7.4033 7.8832 76.3295 73.7589 73.8514 24.3929 32.5059 31.6526 0.3349 0.3152 0.1314 2.2859 2.0037 1.6998 4.3083 4.4918 0.1768 2.2098 2.2224 0.2297 0.0376 0.0319 0.0346 11.3688 9.3985 9.1901 9.9995 9.4711 8.9604 28.4603 28.1150 4.4783 0.0502 0.0704 0.0156 4.3345 3.8348 1.1652 6.1981 3.0755 3.4421 0.0177 1.2994 1.2297 37.9944 19.7821 20.6429 22.0372 13.8906 15.0354 0.0074 0.2302 0.2085 3.7399 3.7874 0.0463 3.0122 3.3743 2.7882 0.0603 0.0831 0.0280 1.9956 3.0815 6.1921 9.8810 8.4998 14.8777 20.6219 21.1075 4.8560
temp: 298.150 k
press: 1.00000 atm
elementType: 15 6 6 6 6 1 6 1 6 1 1 1 6 6 6 6 1 6 1 6 1 1 1 6 6 6 6 1 6 1 6 1 1 1
symmnumber: 1
zpe: 723545.9 jmol-1
zpe.correction: 0.275584 hartree
zpe.thermalcorrener: 0.291363 hartree
zpe.thermalcorrenthalpy: 0.292307 hartree
zpe.thermalcorrgfe: 0.229488 hartree
zpe.sumelectzpe: -1034.537935 hartree
zpe.sumelectthermal: -1034.522157 hartree
zpe.sumelectthermalent: -1034.521213 hartree
zpe.sumelectthermalfe: -1034.584032 hartree
dipole: -0.0088 0.0006 2.1943
dipole: 2.1943
quadrupole: -104.9422 -105.1786 -115.4654
quadrupole: -0.0613 0.0616 0.0094
quadrupole: 3.5865 3.3501 -6.9367 -0.0613 0.0616 0.0094
hfenergy: -1034.8135195 hartree
pointgroup: C01 [X(C18H15P1)]
dipole: -0.8347753 0.1353093 0.1736671 debye
polarizability: 268.9400511|9.5411854|328.027818|12.3533262|-1.97666|325.4526538 unknown
InChI: InChI=1/C18H15P/c1-4-10-16(11-5-1)19(17-12-6-2-7-13-17)18-14-8-3-9-15-18/h1-15H
charge 0 multiplicity 1
34 atoms
P  -1.32288729 1.89604497 -0.22317546
C  -1.69233878 2.75255371 1.36139543
C  -0.95578313 2.35479346 2.48751483
C  -2.64740599 3.76766316 1.49896096
C  -1.18449384 2.94468947 3.72909143
H  -0.19692217 1.57203206 2.39007726
C  -2.86602251 4.36673555 2.7402321
H  -3.22870945 4.09229863 0.63249236
C  -2.13957092 3.95485506 3.85748365
H  -0.60762687 2.62055753 4.59926723
H  -3.61381341 5.15870018 2.83434637
H  -2.31397242 4.4243328 4.82910793
C  -2.38927991 0.40290617 -0.10511289
C  -2.17404422 -0.61084731 -1.05096326
C  -3.38158044 0.2246332 0.867119
C  -2.94854955 -1.76931086 -1.0375553
H  -1.39246727 -0.48910708 -1.80749487
C  -4.14767675 -0.94145264 0.88720403
H  -3.56166095 1.00234914 1.61336557
C  -3.93620384 -1.93818348 -0.06550885
H  -2.77378037 -2.54854899 -1.7840799
H  -4.91852418 -1.06913314 1.65187898
H  -4.53866416 -2.85012274 -0.04844669
C  -2.24228709 2.92790176 -1.43568665
C  -3.53620032 2.63985634 -1.88759299
C  -1.58625235 4.06499781 -1.93121976
C  -4.16389925 3.47816278 -2.80989341
H  -4.06158961 1.75718238 -1.51482762
C  -2.21940166 4.90841643 -2.84202941
H  -0.56957461 4.29346005 -1.59601497
C  -3.51019019 4.61483875 -3.2856028
H  -5.17390192 3.24205846 -3.15541274
H  -1.69899223 5.79467317 -3.21458913
H  -4.00490726 5.27111279 -4.00631884
