program: Gaussian 16
title: Template file
version: ES64L-G16RevC.01
method: RPBE1PBE
basis: def2SVP
operation: Freq
keyword: #P
keyword: Geom=AllCheck
keyword: Guess=TCheck
keyword: SCRF=Check
keyword: GenChk
keyword: RPBE1PBE/def2SVP
keyword: Freq
converged: YES YES NO NO
title: Mulliken charges:
elementType: C O O O Cs Cs C O O O Cs Cs C O O O Cs Cs C O O O Cs Cs H C C H H C H H N C O C C C C H C H C H H H C C C C H C H C H H H
charge: 0.327399 -0.516720 -0.496225 -0.537923 0.786299 0.711628 0.325971 -0.522225 -0.501885 -0.530876 0.617407 0.731454 0.358706 -0.511614 -0.498254 -0.550204 0.715021 -0.029788 0.333487 -0.352558 -0.438682 -0.461238 0.674745 0.682957 0.266960 -0.111336 0.126404 0.025768 0.037348 0.033034 0.106332 0.041385 -0.569620 0.235392 -0.488370 -0.029656 -0.033201 -0.069553 -0.045900 0.042185 -0.042808 0.065504 -0.042258 0.051851 0.067783 0.055292 -0.042236 -0.029592 -0.058698 -0.045653 0.034663 -0.045721 0.052369 -0.044080 0.044701 0.048571 0.046253
chargesum: -0.00000
title: Mulliken charges with hydrogens summed into heavy atoms:
elementType: C O O O Cs Cs C O O O Cs Cs C O O O Cs Cs C O O O Cs Cs C C C N C O C C C C C C C C C C C C
charge: 0.327399 -0.516720 -0.496225 -0.537923 0.786299 0.711628 0.325971 -0.522225 -0.501885 -0.530876 0.617407 0.731454 0.358706 -0.511614 -0.498254 -0.550204 0.715021 -0.029788 0.333487 -0.085598 -0.438682 -0.461238 0.674745 0.682957 -0.111336 0.189520 0.180751 -0.569620 0.235392 -0.488370 -0.029656 0.008984 -0.004049 0.005951 0.024976 0.013035 -0.042236 0.005072 -0.006329 -0.000952 0.002850 0.002173
chargesum: 0.00000
polarizability: 6.38038910e+02 -4.78445487e+00 5.85508869e+02 3.01536861e+00 -3.16382593e+01 6.07013330e+02
1716.lowfreq: -500.7047 -5.1008 -3.4409 0.0002 0.0003 0.0004 4.8147 5.9089 14.6279
frequency: -500.7047 4.9589 14.5719 16.0528 18.0870 25.5900 26.3102 32.3264 33.8813 36.2565 37.6267 39.4368 40.5332 42.8845 43.3622 44.1081 47.3682 51.0550 53.9038 54.6343 57.8984 59.1517 60.3612 63.2843 64.4405 65.4008 70.3339 74.4873 76.2697 87.2534 88.0449 93.0723 96.2226 99.2876 101.9247 107.0605 110.7058 118.5097 123.3049 124.0956 129.1056 131.9707 134.2811 138.7385 142.9471 146.0731 148.7499 151.6115 153.1196 153.5659 156.0029 175.4619 176.1713 180.7224 225.6726 238.6060 257.2744 268.5198 273.8825 333.4834 345.1660 412.0600 421.5665 424.8095 449.5096 478.2097 492.1543 572.6346 612.4217 628.2864 634.0874 647.2520 661.4069 687.0145 692.1311 692.5160 694.2031 699.6830 700.8430 706.7909 715.6574 720.6137 728.8347 772.0808 794.2637 858.4944 860.5507 866.9539 873.6047 887.2608 900.0739 903.6127 921.6008 948.5658 958.1192 969.8100 1006.2297 1010.2731 1013.3532 1017.2822 1021.7037 1026.4059 1030.5849 1036.4581 1048.4362 1054.0618 1056.9771 1088.7435 1089.4138 1091.4667 1093.5990 1098.3635 1098.6810 1099.7306 1127.1938 1140.0183 1151.1110 1151.8593 1165.5425 1170.1976 1175.8539 1204.4167 1244.3345 1277.4826 1302.7135 1309.4021 1324.8453 1329.8431 1338.0816 1390.5007 1397.5058 1431.7852 1456.5365 1458.9393 1474.1682 1474.9469 1478.0385 1481.8220 1489.9064 1517.4104 1518.1001 1527.0215 1527.4204 1538.3107 1572.7442 1659.4921 1664.0569 1679.6346 1683.9569 1724.6539 2815.1060 2867.9476 2899.2987 3079.1596 3120.8326 3197.2220 3198.0328 3202.5472 3205.5629 3210.7329 3215.0669 3216.5593 3221.6142 3224.2797 3225.2363
redmass: 11.1163 8.8993 12.1277 34.0579 11.0299 11.0134 8.8785 9.7942 32.0578 13.8042 14.0603 26.3942 19.8776 12.9876 26.6296 23.8814 20.7388 56.2798 12.5773 24.5721 27.5710 14.1924 15.4386 45.8717 28.4885 14.1915 19.6948 9.9278 10.8912 14.2463 7.9256 16.2209 15.0594 16.8451 8.3344 11.2499 16.7349 17.0061 16.9089 16.2793 11.2786 6.3888 15.6321 16.6276 17.3634 16.1502 15.5372 15.5078 11.4552 4.1653 14.7308 16.4666 15.8204 16.5662 3.7098 6.3328 4.7121 4.6665 12.2681 4.8255 3.9642 3.1729 2.8801 4.0537 2.7953 5.9596 3.4252 3.0454 4.5287 6.3133 5.9370 5.4585 7.7644 12.4593 13.7417 15.3398 15.5247 15.5944 15.5760 15.3728 5.5878 1.5526 1.5153 2.1189 2.3608 11.9223 2.3558 1.2556 1.2474 10.2798 12.6105 12.6076 2.0862 1.5146 2.0152 5.3131 1.3977 1.6132 2.3386 3.3280 2.5743 1.3824 1.3844 3.0681 8.3136 1.8398 2.0533 1.8233 1.4133 4.5816 1.7037 15.8940 15.7375 1.2122 1.3319 3.1207 1.0729 1.0826 1.1080 1.4149 1.1434 1.3919 2.8810 3.6729 1.8511 1.4712 1.3803 2.6162 2.0151 8.0746 8.8373 3.5070 12.3208 11.9378 1.5198 2.3143 3.0674 2.1010 1.4305 12.5412 12.8210 2.6590 2.4688 11.2098 4.3405 6.6899 6.7950 6.6209 6.6183 7.5442 1.0922 1.0722 1.0713 1.0903 1.0921 1.0868 1.0867 1.0894 1.0898 1.0932 1.0941 1.0962 1.0953 1.1008 1.0996
irintensity: 1567.5601 0.2041 0.5129 6.8496 1.7809 1.5373 1.4358 1.8896 2.0999 0.8181 4.1464 3.9387 2.1960 5.1819 2.8179 1.4695 2.2833 3.5134 0.4862 1.8806 9.7862 7.0902 1.4934 5.2896 8.3270 8.4727 8.8375 9.3195 23.2746 9.7688 14.0731 28.9479 8.7770 18.9300 32.0358 46.7935 30.4050 8.8659 97.9059 48.5162 13.2839 2.0753 53.7980 58.3852 177.1507 18.0748 74.4716 8.5344 26.8821 15.6750 58.0768 72.7456 14.3121 56.9736 0.1796 19.1771 11.0139 1.8788 106.2140 4.2177 7.6008 8.5895 0.1310 15.0980 9.3613 54.3198 5.8542 57.3525 45.9113 0.6865 15.9649 37.5132 2.2752 81.7303 18.4062 7.2849 17.8088 6.5106 7.6093 12.7995 12.0489 54.5723 124.8729 23.5438 27.1254 41.7561 67.2278 0.0687 1.2909 63.5971 45.2907 55.2616 10.3644 11.8590 6.3332 97.0258 0.3128 1.3356 2.5714 0.7631 3.4548 4.7658 3.0040 82.4969 97.2645 28.1832 22.5763 12.6519 1.6498 14.6207 55.6339 9.8710 5.7403 3.7961 195.0911 38.9328 0.1310 0.7501 2.0429 12.4393 5.8690 10.8679 48.4604 12.5149 26.4234 1.0701 5.4507 26.0875 1672.6765 0.8561 1.0160 285.0107 473.5360 1948.4104 83.0854 9.7885 435.9971 2.9802 66.7638 1666.7742 944.4704 33.1591 22.1481 912.8666 96.7898 0.5146 3.7395 14.8659 6.5620 917.6537 2174.5877 399.0181 273.1350 85.0447 30.7086 2.6929 1.0247 0.4648 6.8260 3.9045 6.5661 15.9592 17.5552 15.9917 6.4222
temp: 298.150 k
press: 1.00000 atm
elementType: 6 8 8 8 55 55 6 8 8 8 55 55 6 8 8 8 55 55 6 8 8 8 55 55 1 6 6 1 1 6 1 1 7 6 8 6 6 6 6 1 6 1 6 1 1 1 6 6 6 6 1 6 1 6 1 1 1
symmnumber: 1
zpe: 884600.6 jmol-1
zpe.correction: 0.336927 hartree
zpe.thermalcorrener: 0.388823 hartree
zpe.thermalcorrenthalpy: 0.389767 hartree
zpe.thermalcorrgfe: 0.229469 hartree
zpe.sumelectzpe: -1962.346265 hartree
zpe.sumelectthermal: -1962.294369 hartree
zpe.sumelectthermalent: -1962.293425 hartree
zpe.sumelectthermalfe: -1962.453723 hartree
dipole: -0.5245 -0.8386 -13.9478
dipole: 13.9829
quadrupole: -321.5247 -311.4142 -301.0482
quadrupole: -17.1393 -35.0811 -13.9356
quadrupole: -10.1956 -0.0852 10.2808 -17.1393 -35.0811 -13.9356
hfenergy: -1962.6831919 hartree
pointgroup: C01 [X(C20H15Cs8N1O13)]
dipole: -0.2063402 -0.3299495 -5.4875052 debye
polarizability: 638.0389098|-4.7844549|585.5088693|3.0153686|-31.6382593|607.0133296 unknown
InChI: InChI=1/C16H14NO.CHO3.3CO3.8Cs/c1-3-7-13(8-4-1)16(14-9-5-2-6-10-14)15(18-16)11-17-12-15;4*2-1(3)4;;;;;;;;/h1-10H,11-12H2;2H;;;;;;;;;;;/q2*-1;;;;;;;;;;2*+1/rC20H15Cs8NO13/c1-3-7-12(8-4-1)16(13-9-5-2-6-10-13)15-11-29-14(15)22(29)18-24(34(18)22)27-19-21(32(15)16)38(19)25(19,37(19)27)20-23-17(30-23)31-28(19,20,24,25,27,38,39(20,23)25,41(19,21,24)27)40(18,24,27)26(20,27,33(17)23,35(18)22,36(20)23)42(20,25,27)28/h1-10,31H,11,14H2
charge 0 multiplicity 1
57 atoms
C  -0.64764456 1.11543435 -3.74534931
O  -0.7811687 2.19338995 -3.04680805
O  -1.59809831 0.69672284 -4.49459501
O  0.45658519 0.4414619 -3.65162706
Cs 1.95187899 3.09203942 -3.79336244
Cs -1.30214608 -2.12487201 -3.5772139
C  -3.298096 -0.61481419 -0.20665036
O  -3.12391521 0.61210483 0.1636778
O  -3.97739939 -1.42620204 0.51464006
O  -2.74708667 -1.01974562 -1.3067957
Cs -1.82309009 -3.56032741 0.28804616
Cs -3.70152187 1.64592159 -2.60158175
C  1.54240687 -3.06903584 -0.60446657
O  0.64956009 -2.49848081 -1.3327356
O  2.73636025 -3.23448238 -1.02799857
O  1.22850869 -3.46464081 0.59884275
Cs 2.80133367 -1.20499028 -3.18704116
Cs -0.09781231 0.47999926 -0.47014992
C  -0.23841583 -1.12779402 2.68961336
O  0.91448352 -1.37352147 2.01529925
O  -0.37030918 0.03549874 3.12918666
O  -1.07006282 -2.06625639 2.7919864
Cs -3.40126818 -0.04156463 3.07100092
Cs 4.0025697 -2.94688368 1.68734575
H  0.90078681 -2.26381768 1.51874759
C  3.99446776 1.30769332 -0.15107937
C  5.26649393 0.58065553 -0.32202441
H  5.28116624 -0.15274928 -1.16650166
H  6.20804519 1.15598741 -0.3235084
C  3.38583389 0.17231033 0.55599069
H  2.6396535 0.36546352 1.34166579
H  3.01390791 -0.65264435 -0.09853318
N  4.79712406 0.07275256 0.9789104
C  3.714003 2.73323119 -0.01335292
O  3.21075115 2.38758182 -1.26508469
C  2.66432402 3.1511627 1.00029282
C  2.87069448 2.9985319 2.37674887
C  1.45711461 3.69524979 0.5532495
C  1.88365282 3.37847656 3.2855958
H  3.80287279 2.55876078 2.74011125
C  0.47228655 4.08835946 1.4619809
H  1.28857709 3.79123393 -0.52212693
C  0.68179707 3.92753537 2.8320741
H  2.0511243 3.23846678 4.35697279
H  -0.46752324 4.51123175 1.09560583
H  -0.09169095 4.22320473 3.54585979
C  4.87778136 3.70185159 -0.0247845
C  5.89738989 3.61886711 0.93084887
C  4.92878142 4.71301524 -0.98829357
C  6.94928384 4.53455513 0.92199329
H  5.87406697 2.81510775 1.67157238
C  5.97669317 5.63442524 -0.99313574
H  4.13995989 4.76941608 -1.74317387
C  6.99043943 5.54781193 -0.03766574
H  7.74560197 4.45313272 1.66687225
H  6.00426229 6.42303229 -1.75030422
H  7.81485302 6.26572151 -0.04371745
